{"text_format":"1","workbook":"xlsx","n_sheets":3,"sheets":["Anexo TS","2019","CNAE"],"not_rendered":{"charts":0,"images":0,"macros":1,"external_links":0,"defined_names":3,"comments":1,"pivot_tables":0},"unopened":[],"bounds":{"document_bytes":16777216,"sheet_cells":100000,"rows_first":2000,"rows_last":500,"rows_between":2000,"halvings":0,"cell_chars":16384,"cell_head_chars":4096},"cells_cut":0,"cells_raw":0,"read":"whole","date_system":"1900"}

{"sheet":"Anexo TS","index":0,"n_rows":667,"n_cols":3,"rows_kept":667,"cut":false,"hidden":false,"merged":[]}
["FORNECEDOR","NOTA FISCAL","VALOR"]
["JOSE ELIAS MORAIS",2066,20000]
["ARIVALDO ZOCAL - EIRELI",98,1680]
["ARIVALDO ZOCAL - EIRELI",2401,32285]
["MASTER HIGIENE PROFISSIONAL LTDA",811,18742.5]
["TREVAO HOME CENTER LTDA",94288,326.81]
["CB DESIGN INDUSTRIA E COMERCIO EIRELI",5612,205.52]
["AGROMETAL COMERCIAL DE FERRAGENS LTDA",71394,175]
["UBERDECOR MOVEIS E DECORACOES EIRELI",571,168000]
["TREVAO HOME CENTER LTDA",94345,126]
["TREVAO HOME CENTER LTDA",94329,478.82]
["TREVAO HOME CENTER LTDA",94352,161.46]
["AGROMETAL COMERCIAL DE FERRAGENS LTDA",71638,64.62]
["AGROMETAL COMERCIAL DE FERRAGENS LTDA",71544,273.66000000000003]
["LEO MADEIRAS, MAQUINAS E FERRAGENS S.A.",210106,328.92]
["TREVAO HOME CENTER LTDA",94410,1135.3499999999999]
["TREVAO HOME CENTER LTDA",94407,134.55000000000001]
["D. L. OLIVEIRA PRODUTOS & SERVICOS",4216,1100]
["D. L. OLIVEIRA PRODUTOS & SERVICOS",4300,2400]
["TREVAO HOME CENTER LTDA",94441,121.94]
["AGROMETAL COMERCIAL DE FERRAGENS LTDA",72139,510]
["FERRARE ASSESSORIA LTDA",142,11690]
["COMERCIAL ESTEVES LTDA",119358,115]
["GUAIRA COMERCIO DE TINTAS LTDA",458,403]
["GUAIRA COMERCIO DE TINTAS LTDA",457,332]
["AGROMETAL COMERCIAL DE FERRAGENS LTDA",74015,35.85]
["AGROMETAL COMERCIAL DE FERRAGENS LTDA",73987,83.36]
["AGROMETAL COMERCIAL DE FERRAGENS LTDA",73943,1851.85]
["AGROMETAL COMERCIAL DE FERRAGENS LTDA",73984,616.05999999999995]
["AGROMETAL COMERCIAL DE FERRAGENS LTDA",733939,503.73]
["RAFAEL ROSA TERRAPLENAGEM",191,6000]
["COMERCIAL DE MADEIRAS PANTANAL DA AMAZONIA LTDA",18641,3962.2]
["ELIANE REVESTIMENTOS CERAMICOS LTDA",517573,3657.64]
["LINCIONE METAIS EIRELI",10774,8258.7199999999993]
["VITRAL VIDROS PLANOS LTDA",462739,5042.82]
["AF FORTALEZA FERRO E ACO LTDA",66398,3303]
["ELIANE REVESTIMENTOS CERAMICOS LTDA",285978,1168.42]
["GOL CACAMBA & TERRAPLENAGEM BARRETOS - EIRELI",4191,2646]
["CASA DO VIDRO ESQUADRIAS DE ALUMINIO LTDA",278,2560]
["MORADA LAR E CONSTRUCAO LTDA",2069,5000]
["AGROMETAL COMERCIAL DE FERRAGENS LTDA",74274,938.3]
["GUAIRA COMERCIO DE TINTAS LTDA",168,1846.28]
["GUAIRA COMERCIO DE TINTAS LTDA",287,1593.91]
["PRO TEMPER VIDROS EIRELI",19385,761.94]
["WGR CONSTRUTORA E INCORPORADORA - SPE 02 OLIMPIA LTDA",57,595.48]
["CONSTROESTE CONSTRUTORA E PARTICIPACOES LTDA",46011,14680.9]
["E. LOPES DA SILVA MONTAGENS INDUSTRIAIS",126,18978.259999999998]
["E. LOPES DA SILVA MONTAGENS INDUSTRIAIS",125,3510]
["BASE FUNDACOES E INFRA ESTRUTURAS LTDA",1782,48500]
["R.A. ENGENHARIA DE FUNDACOES RIO PRETO LTDA.",1074,4500]
["HERVAL INDUSTRIA DE MOVEIS, COLCHOES E ESPUMAS LTDA.",673921,89639.81]
["CONSTROESTE CONSTRUTORA E PARTICIPACOES LTDA",46191,14455.04]
["ASTEQUE MOVEIS PARA ESCRITORIO LTDA",9521,1696]
["CONSTROESTE CONSTRUTORA E PARTICIPACOES LTDA",46311,4291.34]
["RAFAEL ROSA TERRAPLENAGEM",301,2792.71]
["LEDZS ILUMINACAO LTDA",269,693.33]
["VOTORANTIM CIMENTOS S.A.",211688,5070.8]
["CONSTROESTE CONSTRUTORA E PARTICIPACOES LTDA",46461,12648.16]
["M. A. DOS SANTOS MATERIAIS PARA CONSTRUCAO LTDA.",22412,918]
["RAFAEL ROSA TERRAPLENAGEM",321,2204.77]
["R. P. INDUSTRIA E COMERCIO DE ARTEFATOS DE CIMENTO LTDA",781,24640]
["G.B PROJETOS - EIRELI",333,3600]
["ENGVISTA ENGENHARIA LTDA",2211,3754]
["RIBEIRO & PERUCHE LTDA",12244,6755]
["AGROMETAL COMERCIAL DE FERRAGENS LTDA",77511,874]
["G.B PROJETOS - EIRELI",334,3600]
["CONSTROESTE CONSTRUTORA E PARTICIPACOES LTDA",4530,11180.07]
["CONSTROESTE CONSTRUTORA E PARTICIPACOES LTDA",45451,3274.97]
["CONSTROESTE CONSTRUTORA E PARTICIPACOES LTDA",4558,13212.81]
["CONSTROESTE CONSTRUTORA E PARTICIPACOES LTDA",45501,5646.5]
["GOL CACAMBA & TERRAPLENAGEM BARRETOS - EIRELI",4561,431.2]
["CONSTROESTE CONSTRUTORA E PARTICIPACOES LTDA",45681,10728.35]
["CONSTROESTE CONSTRUTORA E PARTICIPACOES LTDA",47451,1473]
["RIBEIRO & PERUCHE LTDA",12270,5725.04]
["CONSTROESTE CONSTRUTORA E PARTICIPACOES LTDA",45751,7227.52]
["CONSTROESTE CONSTRUTORA E PARTICIPACOES LTDA",47621,551.88]
["ARCELORMITTAL BRASIL S.A.",273390,120109.5]
["ARCELORMITTAL BRASIL S.A.",273457,22288.83]
["NOROESTE - COMERCIO DE FERRO E ACO EIRELI",83657,10508.12]
["ACOS GOLDONI LTDA",92885,14423.13]
["FERREIRA & FERNANDES DOS SANTOS LTDA",4761,2679.8]
["FERRAMENTAS GERAIS COMERCIO E IMPORTACAO DE FERRAMENTAS E MAQUINAS LTDA",1661911,2739.9]
["CLEITON JANOTA DE FREITAS 31142367827",2181,5832.6]
["GERDAU ACOS LONGOS S.A.",66723,23632.95]
["R. P. INDUSTRIA E COMERCIO DE ARTEFATOS DE CIMENTO LTDA",798,17853.080000000002]
["MANETONI DISTRIBUIDORA DE PRODUTOS SIDERURGICOS IMPORTACAO E EXPORTACAO LTDA",643886,6934.37]
["CONSTROESTE CONSTRUTORA E PARTICIPACOES LTDA",50371,1821.61]
["FERRARE ASSESSORIA LTDA",150,10000]
["MGM DISTRIBUIDORA E COMERCIO DE PISOS EIRELI",1080,1448.94]
["CONSTROESTE CONSTRUTORA E PARTICIPACOES LTDA",48501,13633.89]
["CONSTROESTE CONSTRUTORA E PARTICIPACOES LTDA",48491,16244.64]
["CONSTROESTE CONSTRUTORA E PARTICIPACOES LTDA",50611,780.69]
["VITRAL VIDROS PLANOS LTDA",474686,1347.26]
["VITRAL VIDROS PLANOS LTDA",474683,2013.77]
["HAUS TINTAS E TEXTURAS LTDA",31405,3392.91]
["LAERCIO CARLOS MARCHIONI FABRICA DE MOVEIS DE MADEIRA",14908,8064]
["CONSTROESTE CONSTRUTORA E PARTICIPACOES LTDA",50921,3085.93]
["G.B PROJETOS - EIRELI",336,3600]
["VITRAL VIDROS PLANOS LTDA",475084,499.07]
["VITRAL VIDROS PLANOS LTDA",475054,643.6]
["VITRAL VIDROS PLANOS LTDA",475066,457.26]
["VITRAL VIDROS PLANOS LTDA",475063,1424.36]
["CONSTROESTE CONSTRUTORA E PARTICIPACOES LTDA",50991,240.59]
["VITRAL VIDROS PLANOS LTDA",477000,2031.36]
["MORADA LAR E CONSTRUCAO LTDA",2531,2916.67]
["ANA PAULA EDUARTE - EIRELI",89,3820]
["CONSTROESTE CONSTRUTORA E PARTICIPACOES LTDA",51051,601.47]
["M. A. DOS SANTOS MATERIAIS PARA CONSTRUCAO LTDA.",22666,1000]
["MICHEL GUERRA CARVALHO 01186251018",24447854,7140]
["MICHEL GUERRA CARVALHO 01186251018",24447918,6260]
["TREVAO HOME CENTER LTDA",96505,1861.64]
["TREVAO HOME CENTER LTDA",96504,905.58]
["CONSTROESTE CONSTRUTORA E PARTICIPACOES LTDA",51131,859.25]
["M. A. DOS SANTOS MATERIAIS PARA CONSTRUCAO LTDA.",22686,250]
["VITRAL VIDROS PLANOS LTDA",478159,458.85]
["VITRAL VIDROS PLANOS LTDA",478285,1118.3900000000001]
["ARCELORMITTAL BRASIL S.A.",2744193,1112.5]
["ARCELORMITTAL BRASIL S.A.",274194,2314]
["CENTRO SUL INDUSTRIA E COMERCIO DE PORTAS E JANELAS LTDA.",3340,1010.24]
["VOTORANTIM CIMENTOS S.A.",219729,5070.8]
["BAKOF PLASTICOS LTDA",303845,18550]
["TOPPING FORROS - EIRELI",12744,47151]
["INTERBRAS MATERIAIS DE ACABAMENTO LTDA",198,10383.4]
["CENTRO SUL INDUSTRIA E COMERCIO DE PORTAS E JANELAS LTDA.",3339,3049.74]
["TREVAO HOME CENTER LTDA",96502,817.9]
["CONSTROESTE CONSTRUTORA E PARTICIPACOES LTDA",50711,520.46]
["WN ARGILAS E CERAMICAS LTDA",166,3360]
["MANFRIN , CASSEB & CIA LTDA",55164,1858]
["FERREIRA & FERNANDES DOS SANTOS LTDA",4767,1232.5]
["VITRAL VIDROS PLANOS LTDA",478849,3192.14]
["GESSO NORTE LTDA",78,10875]
["R. P. INDUSTRIA E COMERCIO DE ARTEFATOS DE CIMENTO LTDA",813,5447.8]
["CONSTROESTE CONSTRUTORA E PARTICIPACOES LTDA",52331,1924.72]
["GOL CACAMBA & TERRAPLENAGEM BARRETOS - EIRELI",5081,431.2]
["GOL CACAMBA & TERRAPLENAGEM BARRETOS - EIRELI",5091,431.2]
["GOL CACAMBA & TERRAPLENAGEM BARRETOS - EIRELI",5071,646.79999999999995]
["GOL CACAMBA & TERRAPLENAGEM BARRETOS - EIRELI",5061,862.4]
["JOAO APARECIDO PADILHA JUNIOR",22,4274.16]
["ADOGOMAR APARECIDO DOS SANTOS 29364665805",201952,3000]
["COVILAR INDUSTRIA E COMERCIO DE MOVEIS LTDA",118,4000]
["CONSTROESTE CONSTRUTORA E PARTICIPACOES LTDA",52651,274.95999999999998]
["R. P. INDUSTRIA E COMERCIO DE ARTEFATOS DE CIMENTO LTDA",815,18020.419999999998]
["MICHEL GUERRA CARVALHO 01186251018",24651930,7924.49]
["WN ARGILAS E CERAMICAS LTDA",188,3840]
["FERRARE ASSESSORIA LTDA",151,10000]
["MICHEL GUERRA CARVALHO 01186251018",24652337,7924.49]
["MICHEL GUERRA CARVALHO 01186251018",24652590,7978.55]
["MICHEL GUERRA CARVALHO 01186251018",24652833,5662.2]
["MICHEL GUERRA CARVALHO 01186251018",24652962,5995.27]
["FERREIRA & FERNANDES DOS SANTOS LTDA",4798,1112.8]
["VITRAL VIDROS PLANOS LTDA",478168,2317.73]
["VITRAL VIDROS PLANOS LTDA",480373,1163.82]
["TREVAO HOME CENTER LTDA",97446,2957.11]
["VITRAL VIDROS PLANOS LTDA",479806,893.7]
["VITRAL VIDROS PLANOS LTDA",479793,188.21]
["CONSTROESTE CONSTRUTORA E PARTICIPACOES LTDA",53221,999.28]
["CONSTROESTE CONSTRUTORA E PARTICIPACOES LTDA",53211,785.6]
["VITRAL VIDROS PLANOS LTDA",480563,558.1]
["VITRAL VIDROS PLANOS LTDA",480561,669.47]
["ELETRO TRANSOL IND E COMERCIO MAT ELETRICOS LTDA",208069,1947.78]
["ELETRO CIDADE DE BARRETOS - EIRELI",17592,13000]
["ELETRO CIDADE DE BARRETOS - EIRELI",11041,3341.8]
["CONSTROESTE CONSTRUTORA E PARTICIPACOES LTDA",53371,549.91999999999996]
["CARLOS R. PIMENTA",791,4500]
["TUDO D'AGUA MATERIAIS PARA CONSTRUCAO LTDA.",121566,3000]
["TOPPING FORROS - EIRELI",12877,6157]
["RIACO MATERIAIS PARA CONSTRUCAO LTDA",185021,500]
["VOTORANTIM CIMENTOS S.A.",222297,5350.8]
["MORADA LAR E CONSTRUCAO LTDA",2782,2916.66]
["ANA PAULA EDUARTE - EIRELI",139,23414]
["CONSTROESTE CONSTRUTORA E PARTICIPACOES LTDA",53561,982]
["CONSTROESTE CONSTRUTORA E PARTICIPACOES LTDA",53551,10409.200000000001]
["VITRAL VIDROS PLANOS LTDA",481957,2503.46]
["ELETRO CIDADE DE BARRETOS - EIRELI",17598,7120]
["CONSTROESTE CONSTRUTORA E PARTICIPACOES LTDA",55641,687.4]
["ARIVALDO ZOCAL - EIRELI",2432,15000]
["ARIVALDO ZOCAL - EIRELI",120,3500]
["CONSTROESTE CONSTRUTORA E PARTICIPACOES LTDA",49451,1040.92]
["CONSTROESTE CONSTRUTORA E PARTICIPACOES LTDA",49361,1040.92]
["CONSTROESTE CONSTRUTORA E PARTICIPACOES LTDA",53431,859.25]
["CONSTROESTE CONSTRUTORA E PARTICIPACOES LTDA",51251,17259.63]
["CONSTROESTE CONSTRUTORA E PARTICIPACOES LTDA",51261,1659.58]
["CONSTROESTE CONSTRUTORA E PARTICIPACOES LTDA",53671,761.05]
["CONSTROESTE CONSTRUTORA E PARTICIPACOES LTDA",53661,8067.13]
["IZIDIO FAUSTINO DA SILVA BARRETOS",435,3500]
["ELIAS GARCIA DE SOUZA 85195057168",31,5000]
["CARLOS R. PIMENTA",821,1000]
["BLB BLOCOS INDUSTRIA E COMERCIO EIRELI",3357,160000]
["HERCILIA RIBEIRINHO BIANCHI",575,2400]
["JONE ANDERSON LIMA 35113280801",4,9725.2199999999993]
["MORADA LAR E CONSTRUCAO LTDA",2670,2916.66]
["PASSALACQUA & CIA LTDA",169927,1570]
["CONSTROESTE CONSTRUTORA E PARTICIPACOES LTDA",54421,1787.24]
["TREVAO HOME CENTER LTDA",97488,1510.97]
["ERIVELTO DOS SANTOS FONSECA TERRAPLANAGEM",101,2156]
["CLEITON JANOTA DE FREITAS 31142367827",2411,6804.7]
["ANA PAULA EDUARTE - EIRELI",132,5034]
["ANA PAULA EDUARTE - EIRELI",130,29953]
["CONSTROESTE CONSTRUTORA E PARTICIPACOES LTDA",52551,1237.32]
["RIACO MATERIAIS PARA CONSTRUCAO LTDA",184023,1372.11]
["COMAP MATERIAIS PARA CONSTRUCOES LTDA",45662,1164.25]
["COMAP MATERIAIS PARA CONSTRUCOES LTDA",45661,905.64]
["COMAP MATERIAIS PARA CONSTRUCOES LTDA",45660,244.2]
["MA STEEL INDUSTRIA DE ESTRUTURA METALICA EIRELI",914,52513.36]
["VIDRACARIA CAIEL EIRELI",3931,1750]
["CONSTROESTE CONSTRUTORA E PARTICIPACOES LTDA",50821,650.57000000000005]
["VITRAL VIDROS PLANOS LTDA",481145,3217.18]
["VITRAL VIDROS PLANOS LTDA",480981,854.97]
["RIACO MATERIAIS PARA CONSTRUCAO LTDA",148408,1150]
["CONSTROESTE CONSTRUTORA E PARTICIPACOES LTDA",55141,1374.8]
["WGR CONSTRUTORA E INCORPORADORA - SPE 02 OLIMPIA LTDA",61,2502.4]
["WGR CONSTRUTORA E INCORPORADORA - SPE 02 OLIMPIA LTDA",60,1659.16]
["ELIAS GARCIA DE SOUZA 85195057168",39,11000]
["FERRARE ASSESSORIA LTDA",155,11000]
["CONSTROESTE CONSTRUTORA E PARTICIPACOES LTDA",53101,9400.7999999999993]
["BERGAMO EXTRACAO DE AREIA E PRESTACAO DE SERVICOS LTDA",10095,788.15]
["VITRAL VIDROS PLANOS LTDA",481284,3182.64]
["BERGAMO EXTRACAO DE AREIA E PRESTACAO DE SERVICOS LTDA",10096,808.5]
["CONSTROESTE CONSTRUTORA E PARTICIPACOES LTDA",55301,687.4]
["CONSTROESTE CONSTRUTORA E PARTICIPACOES LTDA",55501,549.91999999999996]
["FERREIRA & FERNANDES DOS SANTOS LTDA",4851,1272]
["FERREIRA & FERNANDES DOS SANTOS LTDA",4850,1519]
["FERREIRA & FERNANDES DOS SANTOS LTDA",4852,1343]
["TUDO D'AGUA MATERIAIS PARA CONSTRUCAO LTDA.",122678,40852.370000000003]
["CONSTROESTE CONSTRUTORA E PARTICIPACOES LTDA",51431,859.25]
["CONSTROESTE CONSTRUTORA E PARTICIPACOES LTDA",56001,18892.7]
["CONSTROESTE CONSTRUTORA E PARTICIPACOES LTDA",56011,1730.77]
["GUAIRA COMERCIO DE TINTAS LTDA",1724,930]
["E. LOPES DA SILVA MONTAGENS INDUSTRIAIS",147,4712.5]
["GOL BARRETOS CONSTRUCOES - EIRELI",101,646.79999999999995]
["GOL BARRETOS CONSTRUCOES - EIRELI",111,1509.2]
["CARLOS R. PIMENTA",871,11000]
["RIACO MATERIAIS PARA CONSTRUCAO LTDA",186729,2679.57]
["TREVAO HOME CENTER LTDA",98341,2400]
["ERIVELTO DOS SANTOS FONSECA TERRAPLANAGEM",131,5772.2]
["GESSO NORTE LTDA",185,17286.36]
["TUDO D'AGUA MATERIAIS PARA CONSTRUCAO LTDA.",124858,4848.3999999999996]
["CONSTROESTE CONSTRUTORA E PARTICIPACOES LTDA",54671,842.06]
["CONSTROESTE CONSTRUTORA E PARTICIPACOES LTDA",56871,1099.8399999999999]
["HIPOLITO ELETRICA COMERCIO E SERVICOS DE GUINCHO LTDA",5401,3339]
["VOTORANTIM CIMENTOS S.A.",225820,4947.6000000000004]
["HIPOLITO ELETRICA COMERCIO E SERVICOS DE GUINCHO LTDA",5496,488.86]
["CLEITON JANOTA DE FREITAS 31142367827",2521,7096.33]
["TUDO D'AGUA MATERIAIS PARA CONSTRUCAO LTDA.",125040,2021.03]
["MANFRIN , CASSEB & CIA LTDA",56818,1420]
["ANA PAULA EDUARTE - EIRELI",158,1920]
["CONSTROESTE CONSTRUTORA E PARTICIPACOES LTDA",57181,1924.72]
["CONSTROESTE CONSTRUTORA E PARTICIPACOES LTDA",57671,824.88]
["CONSTROESTE CONSTRUTORA E PARTICIPACOES LTDA",12191,325.62]
["TUDO D'AGUA MATERIAIS PARA CONSTRUCAO LTDA.",126096,1150]
["FERRARE ASSESSORIA LTDA",157,11000]
["CONSTROESTE CONSTRUTORA E PARTICIPACOES LTDA",57751,10013.65]
["CONSTROESTE CONSTRUTORA E PARTICIPACOES LTDA",57761,925]
["CONSTROESTE CONSTRUTORA E PARTICIPACOES LTDA",57971,16508.990000000002]
["CONSTROESTE CONSTRUTORA E PARTICIPACOES LTDA",57981,1497.55]
["CONSTROESTE CONSTRUTORA E PARTICIPACOES LTDA",58111,811.92]
["ANA PAULA EDUARTE - EIRELI",188,17920]
["MILIMETRO COMERCIO DE FERRAGENS E ACESSORIOS LTDA",3504,2910]
["MILIMETRO COMERCIO DE FERRAGENS E ACESSORIOS LTDA",3505,2560]
["CLEITON JANOTA DE FREITAS 31142367827",2671,7096.33]
["MILIMETRO COMERCIO DE FERRAGENS E ACESSORIOS LTDA",3471,28390.6]
["VOTORANTIM CIMENTOS S.A.",228232,4947.6000000000004]
["CONSTROESTE CONSTRUTORA E PARTICIPACOES LTDA",58791,780.69]
["CONSTROESTE CONSTRUTORA E PARTICIPACOES LTDA",58991,520.46]
["CONSTROESTE CONSTRUTORA E PARTICIPACOES LTDA",59271,1171.03]
["R. P. INDUSTRIA E COMERCIO DE ARTEFATOS DE CIMENTO LTDA",824,18682.310000000001]
["R. P. INDUSTRIA E COMERCIO DE ARTEFATOS DE CIMENTO LTDA",867,18755.919999999998]
["ALAIR MUNIZ DUTRA E FILHOS EXTRACAO LTDA",14279,880]
["ELIANE REVESTIMENTOS CERAMICOS LTDA",943983,11804.8]
["CONSTROESTE CONSTRUTORA E PARTICIPACOES LTDA",59791,650.57000000000005]
["WN ARGILAS E CERAMICAS LTDA",269,3141.6]
["FERRARE ASSESSORIA LTDA",160,11000]
["ELIAS GARCIA DE SOUZA 85195057168",40,2500]
["ELIAS GARCIA DE SOUZA 85195057168",50,3500]
["ANA PAULA EDUARTE - EIRELI",189,1308]
["VOTORANTIM CIMENTOS S.A.",229623,4947.6000000000004]
["TUDO D'AGUA MATERIAIS PARA CONSTRUCAO LTDA.",127889,2638.6]
["CONSTROESTE CONSTRUTORA E PARTICIPACOES LTDA",55651,687.4]
["MORADA LAR E CONSTRUCAO LTDA",3047,2916.66]
["UNISOL AQUECEDORES SOLARES LTDA",43423,38659.629999999997]
["CONSTROESTE CONSTRUTORA E PARTICIPACOES LTDA",60421,947.24]
["CONSTROESTE CONSTRUTORA E PARTICIPACOES LTDA",60431,491]
["ANA PAULA EDUARTE - EIRELI",191,1540]
["VOTORANTIM CIMENTOS S.A.",229938,924.8]
["TUDO D'AGUA MATERIAIS PARA CONSTRUCAO LTDA.",128431,4643.93]
["WN ARGILAS E CERAMICAS LTDA",294,1814.13]
["CONSTROESTE CONSTRUTORA E PARTICIPACOES LTDA",60791,1561.38]
["TUDO D'AGUA MATERIAIS PARA CONSTRUCAO LTDA.",127710,26778.69]
["ANA PAULA EDUARTE - EIRELI",209,6750]
["ELIAS GARCIA DE SOUZA 85195057168",57,1300]
["COMERCIAL GOLDONI PRODUTOS SIDERURGICOS LTDA",234026,15310.16]
["HAUS TINTAS E TEXTURAS LTDA",41930,622.46]
["CLEITON JANOTA DE FREITAS 31142367827",2831,7096.33]
["ANA PAULA EDUARTE - EIRELI",211,3460]
["AGROMETAL COMERCIAL DE FERRAGENS LTDA",92876,1482.5]
["AGROMETAL COMERCIAL DE FERRAGENS LTDA",92997,1542.5]
["VOTORANTIM CIMENTOS S.A.",231212,4947.6000000000004]
["CONSTROESTE CONSTRUTORA E PARTICIPACOES LTDA",59471,1040.92]
["FRIGO & CARDOSO EXTINTORES LTDA",4162,18681]
["J. C. M. NITEROI REFRIGERACAO LTDA",34752,9958.5400000000009]
["WN ARGILAS E CERAMICAS LTDA",300,2010.13]
["GOL BARRETOS CONSTRUCOES - EIRELI",401,2587.1999999999998]
["CONSTROESTE CONSTRUTORA E PARTICIPACOES LTDA",61701,910.8]
["FRIGO & CARDOSO EXTINTORES LTDA",12864,1600]
["R. L. P. MILANES",2175,22500]
["TUDO D'AGUA MATERIAIS PARA CONSTRUCAO LTDA.",126687,1174.8499999999999]
["FERRARE ASSESSORIA LTDA",163,11000]
["CONSTROESTE CONSTRUTORA E PARTICIPACOES LTDA",60271,17050.27]
["CONSTROESTE CONSTRUTORA E PARTICIPACOES LTDA",60281,1546.65]
["CONSTROESTE CONSTRUTORA E PARTICIPACOES LTDA",62131,16324.73]
["R. P. INDUSTRIA E COMERCIO DE ARTEFATOS DE CIMENTO LTDA",844,16855.82]
["TUDO D'AGUA MATERIAIS PARA CONSTRUCAO LTDA.",129438,8894]
["TUDO D'AGUA MATERIAIS PARA CONSTRUCAO LTDA.",129439,10080]
["VOTORANTIM CIMENTOS S.A.",232515,4947.6000000000004]
["CONDUMAX - ELETRO METALURGICA CIAFUNDI LTDA",224255,25366.04]
["CALIXTO SERVICOS EM GESSO EIRELI",5,33682.94]
["FRIGO & CARDOSO EXTINTORES LTDA",12957,10000]
["MORADA LAR E CONSTRUCAO LTDA",3209,2916.66]
["ACOS GOLDONI LTDA",98963,17809.41]
["VOTORANTIM CIMENTOS S.A.",233607,4947.6000000000004]
["CLEITON JANOTA DE FREITAS 31142367827",2981,1749.78]
["VOTORANTIM CIMENTOS S.A.",234260,4947.6000000000004]
["R. P. INDUSTRIA E COMERCIO DE ARTEFATOS DE CIMENTO LTDA",892,9864.1]
["FERREIRA & FERNANDES DOS SANTOS LTDA",4925,1354.9]
["CONSTROESTE CONSTRUTORA E PARTICIPACOES LTDA",62321,736.5]
["CONSTROESTE CONSTRUTORA E PARTICIPACOES LTDA",62311,8335.61]
["CONSTROESTE CONSTRUTORA E PARTICIPACOES LTDA",64321,260.23]
["ANA PAULA EDUARTE - EIRELI",261,1860.4]
["ANA PAULA EDUARTE - EIRELI",275,1750]
["CONSTROESTE CONSTRUTORA E PARTICIPACOES LTDA",62621,1623.84]
["CONSTROESTE CONSTRUTORA E PARTICIPACOES LTDA",62631,491]
["CONSTROESTE CONSTRUTORA E PARTICIPACOES LTDA",64441,485]
["CONSTROESTE CONSTRUTORA E PARTICIPACOES LTDA",64451,4059.59]
["AGROMETAL COMERCIAL DE FERRAGENS LTDA",103011,3600]
["VOTORANTIM CIMENTOS S.A.",235593,4947.6000000000004]
["TUDO D'AGUA MATERIAIS PARA CONSTRUCAO LTDA.",131454,5900]
["SERRALHERIA JB LTDA",1432,20000]
["CALIXTO SERVICOS EM GESSO EIRELI",14,2400]
["CALIXTO SERVICOS EM GESSO EIRELI",12,67365.88]
["CALIXTO SERVICOS EM GESSO EIRELI",19,40418.22]
["CASA DO EPI COMERCIO VAREJISTA BARRETOS LTDA","00000.3841",180]
["LOJAS CEM S.A",13742696,6124.35]
["LEDZS ILUMINACAO LTDA",400,22808.29]
["VOTORANTIM CIMENTOS S.A.",240604,4930]
["SERRALHERIA JB LTDA",1442,1980]
["FERRARE ASSESSORIA LTDA",181,11000]
["TUDO D'AGUA MATERIAIS PARA CONSTRUCAO LTDA.",133110,1536.37]
["TUDO D'AGUA MATERIAIS PARA CONSTRUCAO LTDA.",135062,10755.83]
["TUDO D'AGUA MATERIAIS PARA CONSTRUCAO LTDA.",135074,9887.41]
["CONSTRULOG BARRETOS LTDA",1901,907]
["CONSTRULOG BARRETOS LTDA",1861,80]
["EXPANDIR CONSTRUTORA",161,10000]
["TUDO D'AGUA MATERIAIS PARA CONSTRUCAO LTDA.",129879,20340.599999999999]
["GUAIRA COMERCIO DE TINTAS LTDA",2766,973.94]
["IMPERMAXX IMPERMEABILIZACAO - EIRELI",228,30000.2]
["GUAIRA COMERCIO DE TINTAS LTDA",3006,4975.5600000000004]
["GUAIRA COMERCIO DE TINTAS LTDA",3004,1488]
["FERREIRA AYUB COMERCIO DE MATERIAIS ELETRICOS LTDA",8625,603.5]
["GOL BARRETOS CONSTRUCOES - EIRELI",681,1980]
["DURATEX S.A.",1190817,3319.33]
["DURATEX S.A.",2731714,32452.71]
["TUDO D'AGUA MATERIAIS PARA CONSTRUCAO LTDA.",1193764,2012.59]
["ENFIX COMERCIAL LTDA",17841,10300]
["TUDO D'AGUA MATERIAIS PARA CONSTRUCAO LTDA.",135388,1520]
["LOJAS CEM S.A",14487922,1880]
["GUAIRA COMERCIO DE TINTAS LTDA",3243,3906]
["AC MATERIAIS ELETRICOS LTDA",16762,3322.45]
["BUSCARIOLI COMERCIO E OFICINA DE MOTORES ELETRICOS LTDA.","000.099.373",4908]
["NEOTERMICA ISOLANTES TERMICOS E REVESTIMENTOS METALICOS LTDA.",70848,3218.61]
["DURATEX S.A.",1193764,11178]
["RENTSERVICE LOCACAO DE EQUIPAMENTOS LTDA",7265,5965]
["TUDO D'AGUA MATERIAIS PARA CONSTRUCAO LTDA.",135378,455.55]
["4M SAS DISTRIBUIDORA EIRELI",5128,47216.76]
["COMAP MATERIAIS PARA CONSTRUCOES LTDA",49194,2120.9]
["FRIGELAR COMERCIO E INDUSTRIA LTDA",416892,2310.63]
["J. BELOTI GRANITOS E MARMORES EIRELI",183,18000]
["AGROMETAL COMERCIAL DE FERRAGENS LTDA",109129,582]
["AGROMETAL COMERCIAL DE FERRAGENS LTDA",109141,2255.25]
["CONSTRULOG BARRETOS LTDA",1898,1720]
["EXPANDIR CONSTRUTORA",171,8500]
["INDUSTRIA E COMERCIO DE TINTAS ROMA LTDA",16370,5414]
["TUDO D'AGUA MATERIAIS PARA CONSTRUCAO LTDA.",135900,2476.11]
["MORADA LAR E CONSTRUCAO LTDA",3456,2916.66]
["CONSTROESTE CONSTRUTORA E PARTICIPACOES LTDA",63291,650.57000000000005]
["CONSTROESTE CONSTRUTORA E PARTICIPACOES LTDA",63191,520.46]
["VITRAL VIDROS PLANOS LTDA",499936,1167.8]
["TUDO D'AGUA MATERIAIS PARA CONSTRUCAO LTDA.",131206,1508.97]
["CONSTROESTE CONSTRUTORA E PARTICIPACOES LTDA",65131,780.69]
["GOL BARRETOS CONSTRUCOES - EIRELI",641,6252.4]
["FERREIRA AYUB COMERCIO DE MATERIAIS ELETRICOS LTDA",8513,2400]
["FERREIRA AYUB COMERCIO DE MATERIAIS ELETRICOS LTDA",8512,3922.8]
["HAUS TINTAS E TEXTURAS LTDA",46645,622.46]
["HAUS TINTAS E TEXTURAS LTDA",45646,622.46]
["HAUS TINTAS E TEXTURAS LTDA",45639,622.46]
["HAUS TINTAS E TEXTURAS LTDA",45647,497.96]
["FERRARE ASSESSORIA LTDA",178,11000]
["CONSTROESTE CONSTRUTORA E PARTICIPACOES LTDA",64061,910.8]
["M.W. INDUSTRIA E COMERCIO DE PORTAS CORTA-FOGO LTDA",61,11500]
["MEBRAS METAIS DO BRASIL EIRELI",76326,31055.22]
["MORADA LAR E CONSTRUCAO LTDA",3595,2916.66]
["AGROMETAL COMERCIAL DE FERRAGENS LTDA",102273,1839]
["LAURO CESAR FERRAZ REVESTIMENTOS - EIRELI",4328,6630]
["LAURO CESAR FERRAZ REVESTIMENTOS - EIRELI",4326,35458.800000000003]
["LAURO CESAR FERRAZ REVESTIMENTOS - EIRELI",4327,5212]
["SERRALHERIA JB LTDA",1441,20000]
["TUDO D'AGUA MATERIAIS PARA CONSTRUCAO LTDA.",134066,10000]
["VITRAL VIDROS PLANOS LTDA",495389,74361.34]
["TUDO D'AGUA MATERIAIS PARA CONSTRUCAO LTDA.",133635,387.3]
["JB FIRE COMERCIAL EIRELI",2162,36147.47]
["CALIXTO SERVICOS EM GESSO EIRELI",20,18220.8]
["CONDUMAX - ELETRO METALURGICA CIAFUNDI LTDA",23127,21567.91]
["CONDUMAX - ELETRO METALURGICA CIAFUNDI LTDA",231188,4981.59]
["CALIXTO SERVICOS EM GESSO EIRELI",25,20753.72]
["FRIGELAR COMERCIO E INDUSTRIA LTDA",417505,2769.85]
["CONSTROESTE CONSTRUTORA E PARTICIPACOES LTDA",69691,1335.52]
["VOTORANTIM CIMENTOS S.A.",242027,4361.5]
["CONSTROESTE CONSTRUTORA E PARTICIPACOES LTDA",69991,500.82]
["JOSE ELIAS MORAIS",2253,21636.720000000001]
["INDUSTRIA E COMERCIO DE TINTAS ROMA LTDA",16394,1396]
["FERRARE ASSESSORIA LTDA",184,11000]
["EXPANDIR CONSTRUTORA",191,9220]
["GOL BARRETOS CONSTRUCOES - EIRELI",801,3234]
["CASA TOGNINI MATERIAIS HIDRAULICOS E SANITARIOS LTDA",397640,10232.86]
["CASA TOGNINI MATERIAIS HIDRAULICOS E SANITARIOS LTDA",397639,4028.91]
["CASA TOGNINI MATERIAIS HIDRAULICOS E SANITARIOS LTDA",397638,4927.2]
["IMI HYDRONIC ENGENHARIA LTDA.",20520,5912.91]
["TERMOCOP INSTALACOES INDUSTRIAIS LTDA",1467,14300]
["ONITY LTDA.",61,5760]
["TERMOCOP INSTALACOES INDUSTRIAIS LTDA",1468,6499.2]
["GUAIRA COMERCIO DE TINTAS LTDA",3438,4466]
["AGROMETAL COMERCIAL DE FERRAGENS LTDA",110767,522.37]
["TUDO D'AGUA MATERIAIS PARA CONSTRUCAO LTDA.",135382,2012.59]
["CALIXTO SERVICOS EM GESSO EIRELI",26,1000]
["TUDO D'AGUA MATERIAIS PARA CONSTRUCAO LTDA.",136627,278.95]
["ELIAS GARCIA DE SOUZA 85195057168",75,2500]
["FRIGELAR COMERCIO E INDUSTRIA LTDA",416892,9242.52]
["MERCADO DO ALUMINIO EIRELI",416892,12075]
["ANTONIO CARLOS FERREIRA VARES","000.003.404",500]
["R. P. INDUSTRIA E COMERCIO DE ARTEFATOS DE CIMENTO LTDA",962,200]
["RENTSERVICE LOCACAO DE EQUIPAMENTOS LTDA",5331,140]
["RENTSERVICE LOCACAO DE EQUIPAMENTOS LTDA",5320,140]
["MILTON CARLOS FRIGO",1147,13277.4]
["FERRARE ASSESSORIA LTDA",187,7700]
["MULTISHINE ATELIE QUIMICO EIRELI",8179,240.45]
["MULTISHINE ATELIE QUIMICO EIRELI",8209,60.2]
["JB FIRE COMERCIAL EIRELI",2309,2589.54]
["TREVAO HOME CENTER LTDA",102828,901]
["TOPPING FORROS - EIRELI",14194,6246]
["ANTONIO CARLOS FERREIRA VARES","000.003.455",210]
["EXPANDIR CONSTRUTORA",221,10000]
["CONSTROESTE CONSTRUTORA E PARTICIPACOES LTDA",71631,942.72]
["CONSTROESTE CONSTRUTORA E PARTICIPACOES LTDA",71851,471.36]
["CONSTROESTE CONSTRUTORA E PARTICIPACOES LTDA",72271,628.48]
["CONSTROESTE CONSTRUTORA E PARTICIPACOES LTDA",72821,628.48]
["VOTORANTIM CIMENTOS S.A.",243890,5542.2]
["VOTORANTIM CIMENTOS S.A.",244510,4930.8]
["M.F. DE OLIVEIRA",431,2807.04]
["COMAP MATERIAIS PARA CONSTRUCOES LTDA",49719,622]
["COMAP MATERIAIS PARA CONSTRUCOES LTDA",49720,82.42]
["COMAP MATERIAIS PARA CONSTRUCOES LTDA",49728,1837.37]
["ALAIR MUNIZ DUTRA E FILHOS EXTRACAO LTDA",17447,300]
["ANTONIO CARLOS FERREIRA VARES","000.003.467",380]
["IGM PRESTACAO DE SERVICOS LTDA",2282,17247.8]
["EXPANDIR CONSTRUTORA",231,12908]
["CONSTROESTE CONSTRUTORA E PARTICIPACOES LTDA",71901,2700.5]
["CONSTROESTE CONSTRUTORA E PARTICIPACOES LTDA",73311,962.36]
["AQUALAX COMERCIO DE BANHEIRAS LTDA",4204,14500]
["CALIXTO SERVICOS EM GESSO EIRELI",28,24331.8]
["ELIAS GARCIA DE SOUZA 85195057168",76,2500]
["SERRALHERIA JB LTDA",1449,10000]
["RENTSERVICE LOCACAO DE EQUIPAMENTOS LTDA",8845,5106.96]
["RENTSERVICE LOCACAO DE EQUIPAMENTOS LTDA",8296,5325]
["CONSTROESTE CONSTRUTORA E PARTICIPACOES LTDA",71981,2700.5]
["FERRARE ASSESSORIA LTDA",190,7700]
["CONSTROESTE CONSTRUTORA E PARTICIPACOES LTDA",73191,628.48]
["EXPANDIR CONSTRUTORA",251,3872.4]
["RENTSERVICE LOCACAO DE EQUIPAMENTOS LTDA",9434,5106.96]
["EXPANDIR CONSTRUTORA",261,3872.4]
["RENTSERVICE LOCACAO DE EQUIPAMENTOS LTDA",9663,5325]
["RENTSERVICE LOCACAO DE EQUIPAMENTOS LTDA",9000,5325]
["VOTORANTIM CIMENTOS S.A.",250193,5026]
["EXPANDIR CONSTRUTORA",271,3872.4]
["CECRISA REVEST. CERAMICO S.A",19012,3757.44]
["INDUSTRIA E COMERCIO DE TINTAS ROMA LTDA",16750,1377.94]
["R&JR ARQUITETURA E ENGENHARIA LTDA ME",649,3000]
["MILIMETRO COMERCIO DE FERRAGENS E ACESSORIOS LTDA",4057,2940.75]
["INDUSTRIA E COMERCIO DE TINTAS ROMA LTDA",16823,145.09]
["EXPANDIR CONSTRUTORA",291,3872.4]
["ELIAS GARCIA DE SOUZA 85195057168",80,5000]
["EXPANDIR CONSTRUTORA",311,22128]
["R. L. P. MILANES",1894,2115.04]
["AGROMETAL COMERCIAL DE FERRAGENS LTDA",66705,1479.33]
["VOTORANTIM CIMENTOS S.A.",199845,5253.77]
["VOTORANTIM CIMENTOS S.A.",199152,5341.04]
["CB DESIGN INDUSTRIA E COMERCIO EIRELI",5453,33422.379999999997]
["M.C.M CONSTRUCOES METALICAS",47,31987.81]
["TUDO D'AGUA MATERIAIS PARA CONSTRUCAO LTDA.",111996,8000]
["TUDO D'AGUA MATERIAIS PARA CONSTRUCAO LTDA.",111997,10000]
["R. L. P. MILANES",1896,11760.4]
["R. L. P. MILANES",1895,12400]
["R. L. P. MILANES",1893,7480]
["ELETRO REDE MATERIAIS ELETRICOS LTDA",7075,19880]
["ELETRO REDE MATERIAIS ELETRICOS LTDA",7090,3726.1]
["CS INDUSTRIA DE KIT PORTA PRONTA LTDA",119,11357.96]
["FRIGO & CARDOSO EXTINTORES LTDA",3481,14500]
["EBARA BOMBAS AMERICA DO SUL LTDA",2874,1616.18]
["EBARA BOMBAS AMERICA DO SUL LTDA",22,3730.3]
["FRIGO & CARDOSO EXTINTORES LTDA",3445,11170]
["TUDO D'AGUA MATERIAIS PARA CONSTRUCAO LTDA.",109737,74139.12]
["GESSO NORTE LTDA",72,12904]
["ELIAS GARCIA DE SOUZA 85195057168",9,2500]
["AQUALAX COMERCIO DE BANHEIRAS LTDA",3059,14000]
["PAULO RADAMES BELCARI DE MELO",45,6615]
["GOL CACAMBA & TERRAPLENAGEM BARRETOS - EIRELI",3861,2469.6]
["AGROMETAL COMERCIAL DE FERRAGENS LTDA",66684,2064.59]
["TRANSVOLT'S - MOTORES E TRANSFORMADORES LTDA",14442,12388.19]
["FERRARE ASSESSORIA LTDA",135,13000]
["MLS GERENCIAMENTO DE OBRAS LTDA",300,54908.11]
["ELIANE REVESTIMENTOS CERAMICOS LTDA",517574,1345.73]
["GESSO NORTE LTDA",164,27946.15]
["DECON CONSTRUTORA LTDA",1761,28350]
["PAULO RADAMES BELCARI DE MELO",37,20394.2]
["TEKHTON SOLUCOES EM ENGENHARIA LTDA",211,18208.07]
["SETE SERVICOS TECNICOS DE ENGENHARIA LTDA",3857,3000]
["INDUSTRIA E COMERCIO DE TINTAS ROMA LTDA",14125,5086]
["FRIGO & CARDOSO EXTINTORES LTDA",3473,1248.23]
["MORADA LAR E CONSTRUCAO LTDA",1761,5000]
["INDUSTRIA E COMERCIO DE TINTAS ROMA LTDA",13837,33941]
["TUDO D'AGUA MATERIAIS PARA CONSTRUCAO LTDA.",111865,18765.189999999999]
["JORDIVINO FRANCISCO VARGAS 46430580130",21,8000]
["ELIAS GARCIA DE SOUZA 85195057168",10,2770]
["CAMPOS ARTIGOS DE DECORACAO LTDA",270,5000]
["JULIANE CRISTINA FONSECA 09120794959",6,4500]
["RAFAEL ROSA TERRAPLENAGEM",171,2685]
["GRANDMIX CONCRETO LTDA",62621,3699.37]
["WGR CONSTRUTORA E INCORPORADORA - SPE 02 OLIMPIA LTDA",55,6282.6]
["FORT LUZ MATERIAIS ELETRICOS LTDA",126034,1699]
["ANTONIO FERNANDO BARBOSA JODAS 32764753837",67,2600]
["MORADA LAR E CONSTRUCAO LTDA",1938,5000]
["LEDZS ILUMINACAO LTDA",273,4000]
["CONSTRUCAFEL COMERCIO DE MATERIAIS PARA CONSTRUCAO LTDA",4103,2170]
["MILIMETRO COMERCIO DE FERRAGENS E ACESSORIOS LTDA",3153,1000.6]
["MAURICIO DIAVEIRO CONSTANTINO",16,26473.41]
["GESSO NORTE LTDA",156,30000]
["MECASPE METALURGICA E CALDEIRARIA SAO PEDRO LTDA",2166,50000]
["ANTONIO FERNANDO BARBOSA JODAS 32764753837",66,300]
["HIPOLITO ELETRICA COMERCIO E SERVICOS DE GUINCHO LTDA",3007,350]
["FRIGO & CARDOSO EXTINTORES LTDA",3310,10000]
["EMPORIO DO VIDRO VIDRACARIA COMERCIAL LTDA.",14,15678.73]
["VOTORANTIM CIMENTOS S.A.",196557,5266.8]
["TUDO D'AGUA MATERIAIS PARA CONSTRUCAO LTDA.",110484,570]
["CONSTRU RIBEIRO COMERCIO DE MATERIAIS PARA CONSTRUCAO LTDA",280437,202.3]
["TUDO D'AGUA MATERIAIS PARA CONSTRUCAO LTDA.",110485,2362.13]
["FERREIRA & FERNANDES DOS SANTOS LTDA",4549,5037.25]
["GESSO NORTE LTDA",67,20000]
["IMPERMAXX IMPERMEABILIZACAO - EIRELI",133,22005.87]
["AF FORTALEZA FERRO E ACO LTDA",65022,5813.6]
["WE CONSTRUTORA DE BARRETOS LTDA",13,2494.8000000000002]
["GOL CACAMBA & TERRAPLENAGEM BARRETOS - EIRELI",335,2116.8000000000002]
["COMAP MATERIAIS PARA CONSTRUCOES LTDA",41141,65.14]
["NOGUEIRA & NOGUEIRA OLIMPIA LTDA",23014,407.6]
["FULLMETAL INDUSTRIA E COMERCIO S/A",11572,3644.8]
["MANFRIN , CASSEB & CIA LTDA",44569,1440]
["RINNAI BRASIL TECNOLOGIA DE AQUECIMENTO LTDA.",280111,28317]
["CONDUMAX - ELETRO METALURGICA CIAFUNDI LTDA",197860,9845.82]
["ROCHAFORT LOCACAO DE EQUIPAMENTOS EIRELI",47496,350]
["VOTORANTIM CIMENTOS S.A.",197987,1818.01]
["VOTORANTIM CIMENTOS S.A.",197986,1718.01]
["DALLA COSTA & HORIQUERI SILVA LTDA",7974,27]
["FERREIRA AYUB COMERCIO DE MATERIAIS ELETRICOS LTDA",6294,532.72]
["TUDO D'AGUA MATERIAIS PARA CONSTRUCAO LTDA.",110647,1400]
["MANETONI DISTRIBUIDORA DE PRODUTOS SIDERURGICOS IMPORTACAO E EXPORTACAO LTDA",589007,5959.7]
["DALLA COSTA & HORIQUERI SILVA LTDA",7984,171]
["HIPOLITO ELETRICA COMERCIO E SERVICOS DE GUINCHO LTDA",3058,240]
["TUDO D'AGUA MATERIAIS PARA CONSTRUCAO LTDA.",111158,2899.97]
["COMAP MATERIAIS PARA CONSTRUCOES LTDA",41423,47.35]
["INDFOL INDUSTRIA E COMERCIO LTDA",8595,940.8]
["CASA TOGNINI MATERIAIS HIDRAULICOS E SANITARIOS LTDA",330658,5198.3599999999997]
["TECNO FLUIDOS SISTEMAS DE CONDUCAO EIRELI",88151,5340.44]
["BENEDITO PIANTA - CIMENTOS",544,2199.6]
["TREVAO HOME CENTER LTDA",92706,500]
["ROCHAFORT LOCACAO DE EQUIPAMENTOS EIRELI",47899,480]
["VANGUARDA COMERCIAL HIDRO ELETRICA - EIRELI",39482,3700]
["NEOTERMICA ISOLANTES TERMICOS E REVESTIMENTOS METALICOS LTDA.",59009,1185.58]
["COMAP MATERIAIS PARA CONSTRUCOES LTDA",41500,60.2]
["TUDO D'AGUA MATERIAIS PARA CONSTRUCAO LTDA.",112012,692.69]
["TUDO D'AGUA MATERIAIS PARA CONSTRUCAO LTDA.",112011,129.4]
["TUDO D'AGUA MATERIAIS PARA CONSTRUCAO LTDA.",112013,260.52]
["SFERA COMERCIAL E IMPORTADORA LTDA",129726,1567.28]
["NORTEL SUPRIMENTOS INDUSTRIAIS LTDA",846336,3270.34]
["KRARO TINTAS BARRETOS LTDA",5261,60]
["INDUSTRIA E COMERCIO DE TINTAS ROMA LTDA",13916,5640]
["MANFRIN , CASSEB & CIA LTDA",44272,2427.6]
["TUDO D'AGUA MATERIAIS PARA CONSTRUCAO LTDA.",112158,225]
["LIDER INDUSTRIA E COMERCIO DE EQUIPAMENTOS EIRELI",11462,5902.36]
["TUDO D'AGUA MATERIAIS PARA CONSTRUCAO LTDA.",112149,553.49]
["TUDO D'AGUA MATERIAIS PARA CONSTRUCAO LTDA.",112157,164]
["JOSE ELIAS MORAIS",2021,20000]
["CENTRO SUL INDUSTRIA E COMERCIO DE PORTAS E JANELAS LTDA.",2798,49313.599999999999]
["IGM PRESTACAO DE SERVICOS LTDA",1280,6000]
["IGM PRESTACAO DE SERVICOS LTDA",1281,1788.48]
["IGM PRESTACAO DE SERVICOS LTDA",1282,8480.31]
["TUDO D'AGUA MATERIAIS PARA CONSTRUCAO LTDA.",111162,6104.78]
["INDUSTRIA E COMERCIO DE TINTAS ROMA LTDA",13804,825]
["Blometal Industria e Comercio de Artefatos de Cimento LTDA",3514,735]
["CENTRO SUL INDUSTRIA E COMERCIO DE PORTAS E JANELAS LTDA.",2907,3463.42]
["Acmav - Caldeiraria Montagens Industriais e Locacao de Guindastes LTDA",1229,1760]
["Benitez & Ramos Comercio de Parafusos e Ferragens LTDA",137992,427]
["ROCHAFORT LOCACAO DE EQUIPAMENTOS EIRELI",48517,350]
["COMERCIAL ESTEVES LTDA",114607,540]
["COMAP MATERIAIS PARA CONSTRUCOES LTDA",41720,183.61]
["VOTORANTIM CIMENTOS S.A.",200139,590.01]
["WE CONSTRUTORA DE BARRETOS LTDA",19,8618.4]
["PAULO RADAMES BELCARI DE MELO",38,10870.08]
["RIO LIXAS INDUSTRIA E COMERCIO DE ABRASIVOS, IMPORTACAO E EXPORTACAO LTDA",28780,450]
["FERREIRA & FERNANDES DOS SANTOS LTDA",4574,5981.15]
["HAUS TINTAS E TEXTURAS LTDA",23374,836.91]
["HAUS TINTAS E TEXTURAS LTDA",23375,836.91]
["VOTORANTIM CIMENTOS S.A.",200241,590.01]
["RAFAEL ROSA TERRAPLENAGEM",12,2340]
["SOARES CATANDUVA ALUGUEL DE EQUIPAMENTOS E MAQUINAS LTDA",3623,902.66]
["AGROMETAL COMERCIAL DE FERRAGENS LTDA",65359,2515.54]
["AGROMETAL COMERCIAL DE FERRAGENS LTDA",653558,116.94]
["ROCHAFORT LOCACAO DE EQUIPAMENTOS EIRELI",48894,480]
["SANDRO DA SILVA RODA",781,560]
["SANDRO DA SILVA RODA",801,80]
["SANDRO DA SILVA RODA",871,1400]
["FERRARE ASSESSORIA LTDA",126,13000]
["FERRARE ASSESSORIA LTDA",131,2469.8000000000002]
["FERRARE ASSESSORIA LTDA",130,13000]
["FERNANDO CORREIA DA CRUZ",337,5000]
["GRANDMIX CONCRETO LTDA",59731,7457.94]
["FERRARE ASSESSORIA LTDA",132,13000]
["FERNANDO CORREIA DA CRUZ",338,20000]
["BENEDITO JOSE AISSA CALHAS",98,3500]
["CONSTRULOG BARRETOS LTDA",630,1050]
["R. L. P. MILANES",2134,31882.79]
["REFRIGERACAO DUFRIO COMERCIO E IMPORTACAO LTDA",251133,143690.81]
["INDUSTRIA E COMERCIO DE TINTAS ROMA LTDA",13775,7965]
["GOL CACAMBA & TERRAPLENAGEM BARRETOS - EIRELI",3921,3351.6]
["FERRARE ASSESSORIA LTDA",139,13000]
["EMPORIO DO VIDRO VIDRACARIA COMERCIAL LTDA.",16,22000]
["OFFICE DECOR MOVEIS EIRELI",139,10700]
["FERNANDO CORREIA DA CRUZ",353,4500]
["GESSO NORTE LTDA",180,30000]
["TULIO BERTONCELLO MONTEIRO",308,3923.57]
["TULIO BERTONCELLO MONTEIRO",307,"4,370,00"]
["TULIO BERTONCELLO MONTEIRO",320,1681.54]
["HERVAL INDUSTRIA DE MOVEIS, COLCHOES E ESPUMAS LTDA.",731195,5550.01]
["REFRIGERACAO DUFRIO COMERCIO E IMPORTACAO LTDA",412382,11313.5]
["REFRIGERACAO DUFRIO COMERCIO E IMPORTACAO LTDA",407511,11980]
["CALIXTO SERVICOS EM GESSO EIRELI",6,3000]
["CALIXTO SERVICOS EM GESSO EIRELI",4,10000]
["CALIXTO SERVICOS EM GESSO EIRELI",16,33682.94]
["CALIXTO SERVICOS EM GESSO EIRELI",13,13494.56]
["REFRIGERACAO DUFRIO COMERCIO E IMPORTACAO LTDA",424923,5656.75]
["ARTIMAGE INDUSTRIA E COMERCIO EIRELI",58577,12672.2]
["VOTORANTIM CIMENTOS S.A.",241977,4930.8]
["VOTORANTIM CIMENTOS S.A.",237431,4947.6000000000004]
["VOTORANTIM CIMENTOS S.A.",235734,3754.01]
["VOTORANTIM CIMENTOS S.A.",236723,5504.6]
["MPLAN INDUSTRIA E COMERCIO DE EQUIPAMENTOS PARA CONSTRUCAO LTDA",6149,2013]
["M. MOLETA COMPENSADOS - EIRELI",1638,5372]
["FERREIRA & FERNANDES DOS SANTOS LTDA",4726,3701.25]
["MORADA LAR E CONSTRUCAO LTDA",2434,2916.67]
["TERRENO MUMORI","Matrícula 72.141/72.142",5950000]
[null,"Total",{"$f":"SUM(C2:C666)","v":11043737.179999996}]

{"sheet":"2019","index":1,"n_rows":1188,"n_cols":25,"rows_kept":1188,"cut":false,"hidden":false,"merged":[[0,21,0,23],[1,21,1,23],[0,7,0,9],[0,10,0,11],[0,12,0,15],[0,16,0,19],[0,0,1,6],[1,7,1,9],[1,10,1,11],[1,12,1,15],[1,16,1,19]]}
["CRI Wyndhan",null,null,null,null,null,null,"PAVARINI",null,null,{"$f":"H1","v":"PAVARINI"},null,null,null,null,null,"PAVARINI",null,null,null,"PAVARINI","PAVARINI",null,null,"PAVARINI"]
[null,null,null,null,null,null,null,"VALIDAÇÃO CNPJ",null,null,"VALIDAÇÃO DATA",null,"VALIDAÇÃO DO VENDEDOR",null,null,null,"VALORES",null,null,null,"Verificação dos serviços secundários","Validação Manual",null,null,"GERAL"]
["Empresas","NF","Nº da Nota","Valor","Valor TED","Nome Arquivo","Data de Emissão NF","CNPJ DEVEDOR","CNPJ DO TOMADOR (NF)","STATUS","DATA LIMITE","STATUS","CNPJ DO VENDEDOR","CNAE","ATIVIDA ECONÔMICA","Status","VALOR DA NF","Status","VALOR DO TED","Status","OBS","Status da Validação","Resp","OBS","Status Final"]
["JOSE ELIAS MORAIS","NF",2066,20000,null,"bar 010119","2018-12-11",null,"25.144.267/0001-83",{"$f":"IF(I4=\"\",\"\",IF(OR(I4=H4,LEFT(H4,10)=LEFT(I4,10)),\"OK\",\"NOK\"))","v":"NOK"},{"$f":"IF(A4=\"\",\"\",EDATE(TODAY(),-24))","v":"2018-08-03"},{"$f":"IF(G4=\"\",\"\",IF(G4>=K4,\"OK\",\"NOK\"))","v":"OK"},"55.580.310/0001-14","23.91-5-01","Britamento de pedras, exceto associado à extração - 213-5 - Empresário (Individual)","OK",20000,{"$f":"IF(Q4=\"\",\"\",IF(Q4=D4,\"OK\",\"NOK\"))","v":"OK"},null,{"$f":"IF(S4=\"\",\"\",IF(S4=E4,\"OK\",\"NOK\"))","v":""},null,null,null,null,{"$f":"IF(A4=\"\",\"\",IF(V4=\"OK\",\"OK\",IF(AND(J4=\"OK\",L4=\"OK\",P4=\"OK\",R4=\"OK\"),\"OK\",\"NOK\")))","v":"NOK"}]
["ARIVALDO ZOCAL - EIRELI","NF",98,1680,null,"bar 010119","2018-12-05",null,"25.144.267/0001-83","NOK","2018-08-03",{"$f":"IF(G5=\"\",\"\",IF(G5>=K5,\"OK\",\"NOK\"))","v":"OK"},"73.098.501/0001-26","47.89-0-02","Comércio varejista de plantas e flores naturais","OK",1680,"OK",null,{"$f":"IF(S5=\"\",\"\",IF(S5=E5,\"OK\",\"NOK\"))","v":""},null,null,null,null,"NOK"]
["ARIVALDO ZOCAL - EIRELI","NF",2401,32285,null,"bar 010119","2018-12-05",null,"25.144.267/0001-83","NOK","2018-08-03",{"$f":"IF(G6=\"\",\"\",IF(G6>=K6,\"OK\",\"NOK\"))","v":"OK"},"73.098.501/0001-26","47.89-0-02","Comércio varejista de plantas e flores naturais","OK",32285,"OK",null,{"$f":"IF(S6=\"\",\"\",IF(S6=E6,\"OK\",\"NOK\"))","v":""},null,null,null,null,"NOK"]
["MASTER HIGIENE PROFISSIONAL LTDA","NF",811,18742.5,null,"bar 010119","2018-12-04",null,"25.144.267/0001-83","NOK","2018-08-03",{"$f":"IF(G7=\"\",\"\",IF(G7>=K7,\"OK\",\"NOK\"))","v":"OK"},"11.201.471/0001-84","47.89-0-05","Comércio varejista de produtos saneantes domissanitários","OK",18742.5,"OK",null,{"$f":"IF(S7=\"\",\"\",IF(S7=E7,\"OK\",\"NOK\"))","v":""},"Limpeza de apartamentos",null,null,null,"NOK"]
["TREVAO HOME CENTER LTDA","NF",94288,326.81,null,"bar 030119","2018-12-03",null,"25.144.267/0001-83","NOK","2018-08-03",{"$f":"IF(G8=\"\",\"\",IF(G8>=K8,\"OK\",\"NOK\"))","v":"OK"},"59.567.396/0001-04","47.44-0-05","Comércio varejista de materiais de construção não especificados anteriormente","OK",326.81,"OK",null,"",null,null,null,null,"NOK"]
["CB DESIGN INDUSTRIA E COMERCIO EIRELI","NF",5612,205.52,null,"bar 030119","2018-12-20",null,"25.144.267/0001-83","NOK","2018-08-03",{"$f":"IF(G9=\"\",\"\",IF(G9>=K9,\"OK\",\"NOK\"))","v":"OK"},"16.569.653/0001-26","25.99-3-99","Fabricação de outros produtos de metal não especificados anteriormente","OK",205.52,"OK",null,"",null,null,null,null,"NOK"]
["AGROMETAL COMERCIAL DE FERRAGENS LTDA","NF",71394,175,null,"bar 040119","2018-12-05",null,"25.144.267/0001-83",{"$f":"IF(I10=\"\",\"\",IF(OR(I10=H10,LEFT(H10,10)=LEFT(I10,10)),\"OK\",\"NOK\"))","v":"NOK"},"2018-08-03","OK","48.539.548/0007-26","47.44-0-99","Comércio varejista de materiais de construção em geral","OK",175,"OK",null,"",null,null,null,null,"NOK"]
["UBERDECOR MOVEIS E DECORACOES EIRELI","NF",571,168000,null,"bar 070119","2018-10-05",null,"25.144.267/0001-83","NOK","2018-08-03","OK","12.459.751/0001-50","31.02-1-00","Fabricação de móveis com predominância de metal","OK",168000,"OK",null,"","Compras de mesas e cadeiraas",null,null,null,"NOK"]
["TREVAO HOME CENTER LTDA","NF",94345,126,null,"bar 070119","2018-12-05",null,"25.144.267/0001-83","NOK","2018-08-03","OK","59.567.396/0001-04","47.44-0-05","Comércio varejista de materiais de construção não especificados anteriormente","OK",126,"OK",null,"",null,null,null,null,"NOK"]
["TREVAO HOME CENTER LTDA","NF",94329,478.82,null,"bar 070119","2018-12-05",null,"25.144.267/0001-83","NOK","2018-08-03","OK","59.567.396/0001-04","47.44-0-05","Comércio varejista de materiais de construção não especificados anteriormente","OK",478.82,"OK",null,"",null,null,null,null,"NOK"]
["TREVAO HOME CENTER LTDA","NF",94352,161.46,null,"bar 070119","2018-12-16",null,"25.144.267/0001-83","NOK","2018-08-03","OK","59.567.396/0001-04","47.44-0-05","Comércio varejista de materiais de construção não especificados anteriormente","OK",161.46,"OK",null,"",null,null,null,null,"NOK"]
["AGROMETAL COMERCIAL DE FERRAGENS LTDA","NF",71638,64.62,null,"bar 070119","2018-12-07",null,"25.144.267/0001-83","NOK","2018-08-03","OK","48.539.548/0007-26","47.44-0-99","Comércio varejista de materiais de construção em geral","OK",64.62,"OK",null,"",null,null,null,null,"NOK"]
["AGROMETAL COMERCIAL DE FERRAGENS LTDA","NF",71544,273.66000000000003,null,"bar 070119","2018-12-06",null,"25.144.267/0001-83","NOK","2018-08-03","OK","48.539.548/0007-26","47.44-0-99","Comércio varejista de materiais de construção em geral","OK",273.66000000000003,"OK",null,"",null,null,null,null,"NOK"]
["LEO MADEIRAS, MAQUINAS E FERRAGENS S.A.","NF",210106,328.92,null,"bar 090119","2018-12-12",null,"25.144.267/0001-83","NOK","2018-08-03","OK","61.069.373/0015-09","47.44-0-02","Comércio varejista de madeira e artefatos","OK",328.92,"OK",null,"",null,null,null,null,"NOK"]
["TREVAO HOME CENTER LTDA","NF",94410,1135.3499999999999,null,"bar 100119","2018-12-10",null,"25.144.267/0001-83","NOK","2018-08-03","OK","59.567.396/0001-04","47.44-0-05","Comércio varejista de materiais de construção não especificados anteriormente","OK",1135.3499999999999,"OK",null,"",null,null,null,null,"NOK"]
["TREVAO HOME CENTER LTDA","NF",94407,134.55000000000001,null,"bar 100119","2018-12-10",null,"25.144.267/0001-83","NOK","2018-08-03","OK","59.567.396/0001-04","47.44-0-05","Comércio varejista de materiais de construção não especificados anteriormente","OK",134.55000000000001,"OK",null,"",null,null,null,null,"NOK"]
["D. L. OLIVEIRA PRODUTOS & SERVICOS","NF",4216,1100,null,"bar 140119","2018-12-19",null,"25.144.267/0001-83",{"$f":"IF(I20=\"\",\"\",IF(OR(I20=H20,LEFT(H20,10)=LEFT(I20,10)),\"OK\",\"NOK\"))","v":"NOK"},{"$f":"IF(A20=\"\",\"\",EDATE(TODAY(),-24))","v":"2018-08-03"},"OK","37.892.023/0001-68","47.54-7-01","Comércio varejista de móveis","OK",1100,{"$f":"IF(Q20=\"\",\"\",IF(Q20=D20,\"OK\",\"NOK\"))","v":"OK"},null,{"$f":"IF(S20=\"\",\"\",IF(S20=E20,\"OK\",\"NOK\"))","v":""},null,null,null,null,{"$f":"IF(A20=\"\",\"\",IF(V20=\"OK\",\"OK\",IF(AND(J20=\"OK\",L20=\"OK\",P20=\"OK\",R20=\"OK\"),\"OK\",\"NOK\")))","v":"NOK"}]
["D. L. OLIVEIRA PRODUTOS & SERVICOS","NF",4300,2400,null,"bar 140119","2019-01-08",null,"25.144.267/0001-83",{"$f":"IF(I21=\"\",\"\",IF(OR(I21=H21,LEFT(H21,10)=LEFT(I21,10)),\"OK\",\"NOK\"))","v":"NOK"},"2018-08-03","OK","37.892.023/0001-68","47.54-7-01","Comércio varejista de móveis","OK",2400,"OK",null,"",null,null,null,null,"NOK"]
["TREVAO HOME CENTER LTDA","NF",94441,121.94,null,"bar 100119","2018-12-12",null,"25.144.267/0001-83",{"$f":"IF(I22=\"\",\"\",IF(OR(I22=H22,LEFT(H22,10)=LEFT(I22,10)),\"OK\",\"NOK\"))","v":"NOK"},"2018-08-03","OK","59.567.396/0001-04","47.44-0-05","Comércio varejista de materiais de construção não especificados anteriormente","OK",121.94,"OK",null,"",null,null,null,null,"NOK"]
["AGROMETAL COMERCIAL DE FERRAGENS LTDA","NF",72139,510,null,"bar 140119","2018-12-13",null,"25.144.267/0001-83",{"$f":"IF(I23=\"\",\"\",IF(OR(I23=H23,LEFT(H23,10)=LEFT(I23,10)),\"OK\",\"NOK\"))","v":"NOK"},"2018-08-03","OK","48.539.548/0007-26","47.44-0-99","Comércio varejista de materiais de construção em geral","OK",510,"OK",null,"",null,null,null,null,"NOK"]
["FERRARE ASSESSORIA LTDA","NF",142,11690,null,"bar 140119","2019-01-03",null,"25.144.267/0001-83",{"$f":"IF(I24=\"\",\"\",IF(OR(I24=H24,LEFT(H24,10)=LEFT(I24,10)),\"OK\",\"NOK\"))","v":"NOK"},"2018-08-03","OK","16.688.405/0001-02","43.11-8-01","Demolição de edifícios e outras estruturas","OK",11690,"OK",null,"","2,36% ISS R$ 275,88",null,null,null,"NOK"]
["COMERCIAL ESTEVES LTDA","NF",119358,115,null,"bar 170119","2019-01-02",null,"25.144.267/0001-83",{"$f":"IF(I25=\"\",\"\",IF(OR(I25=H25,LEFT(H25,10)=LEFT(I25,10)),\"OK\",\"NOK\"))","v":"NOK"},"2018-08-03",{"$f":"IF(G25=\"\",\"\",IF(G25>=K25,\"OK\",\"NOK\"))","v":"OK"},"44.790.251/0001-92","47.44-0-99","Comércio varejista de materiais de construção em geral","OK",115,"OK",null,"",null,null,null,null,"NOK"]
["GUAIRA COMERCIO DE TINTAS LTDA","NF",458,403,null,"bar 180119","2019-01-02",null,"25.144.267/0001-83","NOK","2018-08-03","OK","72.697.501/0003-41","47.41-5-00","Comércio varejista de tintas e materiais para pintura","OK",403,"OK",null,"",null,null,null,null,"NOK"]
["GUAIRA COMERCIO DE TINTAS LTDA","NF",457,332,null,"bar 180119","2019-01-02",null,"25.144.267/0001-83","NOK","2018-08-03","OK","72.697.501/0003-41","47.41-5-00","Comércio varejista de tintas e materiais para pintura","OK",332,"OK",null,"",null,null,null,null,"NOK"]
["AGROMETAL COMERCIAL DE FERRAGENS LTDA","NF",74015,35.85,null,"bar 210119","2019-01-21",null,"25.144.267/0001-83","NOK","2018-08-03","OK","48.539.548/0007-26","47.44-0-99","Comércio varejista de materiais de construção em geral","OK",35.85,"OK",null,"",null,null,null,null,"NOK"]
["AGROMETAL COMERCIAL DE FERRAGENS LTDA","NF",73987,83.36,null,"bar 210119","2019-01-21",null,"25.144.267/0001-83","NOK","2018-08-03","OK","48.539.548/0007-26","47.44-0-99","Comércio varejista de materiais de construção em geral","OK",83.36,"OK",null,"",null,null,null,null,"NOK"]
["AGROMETAL COMERCIAL DE FERRAGENS LTDA","NF",73943,1851.85,null,"bar 210119","2019-01-21",null,"25.144.267/0001-83","NOK","2018-08-03","OK","48.539.548/0007-26","47.44-0-99","Comércio varejista de materiais de construção em geral","OK",1851.85,{"$f":"IF(Q30=\"\",\"\",IF(Q30=D30,\"OK\",\"NOK\"))","v":"OK"},null,"",null,null,null,null,"NOK"]
["AGROMETAL COMERCIAL DE FERRAGENS LTDA","NF",73984,616.05999999999995,null,"bar 210119","2019-01-11",null,"25.144.267/0001-83","NOK",{"$f":"IF(A31=\"\",\"\",EDATE(TODAY(),-24))","v":"2018-08-03"},"OK","48.539.548/0007-26","47.44-0-99","Comércio varejista de materiais de construção em geral","OK",616.05999999999995,"OK",null,"",null,null,null,null,{"$f":"IF(A31=\"\",\"\",IF(V31=\"OK\",\"OK\",IF(AND(J31=\"OK\",L31=\"OK\",P31=\"OK\",R31=\"OK\"),\"OK\",\"NOK\")))","v":"NOK"}]
["AGROMETAL COMERCIAL DE FERRAGENS LTDA","NF",733939,503.73,null,"bar 210119","2019-01-11",null,"25.144.267/0001-83","NOK","2018-08-03","OK","48.539.548/0007-26","47.44-0-99","Comércio varejista de materiais de construção em geral","OK",503.73,"OK",null,"",null,null,null,null,"NOK"]
["RAFAEL ROSA TERRAPLENAGEM","NF",191,6000,null,"bar 030119","2018-12-21",null,"25.144.267/0001-83","NOK","2018-08-03","OK","26.516.006/0001-83","43.13-4-00","Obras de terraplenagem","OK",6000,"OK",null,"","Serviço de Coleta e Transportes de Entulhos ",null,null,null,"NOK"]
["COMERCIAL DE MADEIRAS PANTANAL DA AMAZONIA LTDA","NF",18641,3962.2,null,"bar 070119","2018-12-06",null,"25.144.267/0001-83","NOK","2018-08-03","OK","00.694.242/0001-22","47.44-0-02 ","Comércio varejista de madeira e artefatos","OK",3962.2,"OK",null,"","Pinus serrado em Pontaleles/ Pinus serrado Tábuas",null,null,null,"NOK"]
["ELIANE REVESTIMENTOS CERAMICOS LTDA","NF",517573,3657.64,null,"bar 110119","2018-09-21",null,"25.144.267/0001-83","NOK","2018-08-03","OK","86.532.538/0032-69","23.42-7-01","Fabricação de azulejos e pisos","OK",3657.64,"OK",null,"","Piso Ceramico",null,null,null,"NOK"]
["LINCIONE METAIS EIRELI","NF",10774,8258.7199999999993,null,"bar 150119","2018-10-23",null,"25.144.267/0001-83","NOK","2018-08-03","OK","71.821.169/0001-50","46.79-6-04","Comércio atacadista especializado de materiais de construção não especificados anteriormente","OK",8258.7199999999993,"OK",null,"","Barra de apoio reca 60 CM",null,null,null,"NOK"]
["VITRAL VIDROS PLANOS LTDA","NF",462739,5042.82,null,"bar 150119","2018-12-12",null,"25.144.267/0001-83","NOK","2018-08-03","OK","71.821.169/0001-50","46.79-6-04","Comércio atacadista especializado de materiais de construção não especificados anteriormente","OK",5042.82,"OK",null,"","Vidro Cristal Plano",null,null,null,"NOK"]
["AF FORTALEZA FERRO E ACO LTDA","NF",66398,3303,null,"bar 170119","2018-12-20",null,"25.144.267/0001-83","NOK","2018-08-03","OK","71.676.670/0002-51","47.44-0-01","Comércio varejista de ferragens e ferramentas","OK",3303,"OK",null,"","Vergalhão 3/8",null,null,null,"NOK"]
["ELIANE REVESTIMENTOS CERAMICOS LTDA","NF",285978,1168.42,null,"bar 180119","2018-11-29",null,"25.144.267/0001-83","NOK","2018-08-03","OK","86.532.538/0032-69","23.42-7-01","Fabricação de azulejos e pisos","OK",1168.42,"OK",null,"","Porcelanato",null,null,null,"NOK"]
["GOL CACAMBA & TERRAPLENAGEM BARRETOS - EIRELI","NF",4191,2646,null,"bar 180119","2019-01-10",null,"25.144.267/0001-83","NOK","2018-08-03","OK","14.794.870/0001-94","38.11-4-00 ","Coleta de resíduos não-perigosos","OK",2646,"OK",null,"","Locação de 15 caçambas de 5 metros",null,null,null,"NOK"]
["CASA DO VIDRO ESQUADRIAS DE ALUMINIO LTDA","NF",278,2560,null,"bar 210119","2018-11-29",null,"25.144.267/0001-83","NOK","2018-08-03","OK","10.199.114/0001-66","47.44-0-01","- Comércio varejista de ferragens e ferramentas","OK",2560,"OK",null,"","Porta de Giro veneziana",null,null,null,"NOK"]
["MORADA LAR E CONSTRUCAO LTDA","NF",2069,5000,null,"bar 210119","2019-01-17",null,"25.144.267/0001-83","NOK","2018-08-03","OK","27.488.256/0001-46","47.44-0-99","Comércio varejista de materiais de construção em geral","OK",5000,"OK",null,"","Tintas",null,null,null,"NOK"]
["AGROMETAL COMERCIAL DE FERRAGENS LTDA","NF",74274,938.3,null,"bar 250119","2019-01-15",null,"25.144.267/0001-83","NOK","2018-08-03","OK","48.539.548/0007-26","47.44-0-99","Comércio varejista de materiais de construção em geral","OK",938.3,"OK",null,"",null,null,null,null,"NOK"]
["GUAIRA COMERCIO DE TINTAS LTDA","NF",168,1846.28,null,"bar 280119","2018-11-22",null,"25.144.267/0001-83","NOK","2018-08-03","OK","72.697.501/0003-41","47.41-5-00 "," Comércio varejista de tintas e materiais para pintura","OK",1846.28,"OK",null,"",null,null,null,null,"NOK"]
["GUAIRA COMERCIO DE TINTAS LTDA","NF",287,1593.91,null,"bar 280119","2018-12-07",null,"25.144.267/0001-83","NOK","2018-08-03","OK","72.697.501/0003-41","47.41-5-00 "," Comércio varejista de tintas e materiais para pintura","OK",1593.91,"OK",null,"",null,null,null,null,"NOK"]
["PRO TEMPER VIDROS EIRELI","NF",19385,761.94,null,"bar 280119","2018-11-28",null,"25.144.267/0001-83","NOK","2018-08-03","OK","16.745.391/0001-03","23.11-7-00 ","Fabricação de vidro plano e de segurança","OK",761.94,"OK",null,"",null,null,null,null,"NOK"]
["WGR CONSTRUTORA E INCORPORADORA - SPE 02 OLIMPIA LTDA","NF",57,595.48,null,"bar 280119","2019-01-16",null,"25.144.267/0001-83","NOK","2018-08-03","OK","17.191.725/0001-07","41.20-4-00","Construção de edifícios","OK",595.48,"OK",null,"",null,null,null,null,"NOK"]
["CONSTROESTE CONSTRUTORA E PARTICIPACOES LTDA","NF",46011,14680.9,null,"bar 010319","2019-01-31",null,"25.144.267/0001-83","NOK","2018-08-03","OK","06.291.846/0004-57","42.99-5-99","Outras obras de engenharia civil não especificadas anteriormente","OK",14680.9,"OK",null,"",null,null,null,null,"NOK"]
["E. LOPES DA SILVA MONTAGENS INDUSTRIAIS","NF",126,18978.259999999998,null,"bar 010319","2019-01-23",null,"25.144.267/0001-83","NOK","2018-08-03","OK","28.822.846/0001-26","47.44-0-99","Comércio varejista de materiais de construção em geral","OK",18978.259999999998,"OK",null,"",null,null,null,null,"NOK"]
["E. LOPES DA SILVA MONTAGENS INDUSTRIAIS","NF",125,3510,null,"bar 010319","2019-01-22",null,"25.144.267/0001-83","NOK","2018-08-03","OK","28.822.846/0001-26","47.44-0-99","Comércio varejista de materiais de construção em geral","OK",3510,"OK",null,"",null,null,null,null,"NOK"]
["BASE FUNDACOES E INFRA ESTRUTURAS LTDA","NF",1782,48500,null,"bar 070319","2019-02-14",null,"25.144.267/0001-83","NOK","2018-08-03","OK","51.801.009/0001-32","43.91-6-00"," Obras de fundações","OK",48500,"OK",null,"",null,null,null,null,"NOK"]
["R.A. ENGENHARIA DE FUNDACOES RIO PRETO LTDA.","NF",1074,4500,null,"bar 070319","2019-02-14",null,"25.144.267/0001-83","NOK","2018-08-03","OK","07.292.846/0001-91","71.19-7-99 ","Atividades técnicas relacionadas à engenharia e arquitetura não especificadas anteriormente","OK",4500,"OK",null,"",null,null,null,null,"NOK"]
["HERVAL INDUSTRIA DE MOVEIS, COLCHOES E ESPUMAS LTDA.","NF",673921,89639.81,null,"bar 070319","2018-10-08",null,"25.144.267/0001-83","NOK","2018-08-03","OK","16.670.753/0001-44","31.01-2-00 ","Fabricação de móveis com predominância de madeira","OK",89639.81,"OK",null,"","Colchão Mola",null,null,null,"NOK"]
["CONSTROESTE CONSTRUTORA E PARTICIPACOES LTDA","NF",46191,14455.04,null,"bar 070319","2019-02-04",null,"25.144.267/0001-83","NOK","2018-08-03","OK","06.291.846/0004-57","42.99-5-99","Outras obras de engenharia civil não especificadas anteriormente","OK",14455.04,"OK",null,"",null,null,null,null,"NOK"]
["ASTEQUE MOVEIS PARA ESCRITORIO LTDA","NF",9521,1696,null,"bar 080319","2019-02-21",null,"25.144.267/0001-83","NOK","2018-08-03","OK","68.400.837/0001-61","47.89-0-07","Comércio varejista de equipamentos para escritório","OK",1696,"OK",null,"","Mesa, gaveteiro, assento encosto",null,null,null,"NOK"]
["CONSTROESTE CONSTRUTORA E PARTICIPACOES LTDA","NF",46311,4291.34,null,"bar 080319","2019-02-06",null,"25.144.267/0001-83","NOK","2018-08-03","OK","06.291.846/0004-57","42.99-5-99","Outras obras de engenharia civil não especificadas anteriormente","OK",4291.34,"OK",null,"",null,null,null,null,"NOK"]
["RAFAEL ROSA TERRAPLENAGEM","NF",301,2792.71,null,"bar 080319","2019-02-20",null,"25.144.267/0001-83","NOK","2018-08-03","OK","26.516.006/0001-00","43.13-4-00","Obras de terraplenagem","OK",2792.71,"OK",null,"",null,null,null,null,"NOK"]
["LEDZS ILUMINACAO LTDA","NF",269,693.33,null,"bar 110319","2018-12-10",null,"25.144.267/0001-83","NOK","2018-08-03","OK","11.037.885/0001-10","47.42-3-00 ","Comércio varejista de material elétrico","OK",693.33,"OK",null,"",null,null,null,null,"NOK"]
["VOTORANTIM CIMENTOS S.A.","NF",211688,5070.8,null,"bar 110319","2019-02-18",null,"25.144.267/0001-83","NOK","2018-08-03","OK","01.637.895/0058-78","46.74-5-00 ","Comércio atacadista de cimento","OK",5070.8,"OK",null,"",null,null,null,null,"NOK"]
["CONSTROESTE CONSTRUTORA E PARTICIPACOES LTDA","NF",46461,12648.16,null,"bar 110319","2019-02-08",null,"25.144.267/0001-83","NOK","2018-08-03","OK","06.291.846/0004-57","42.99-5-99","Outras obras de engenharia civil não especificadas anteriormente","OK",12648.16,"OK",null,"",null,null,null,null,"NOK"]
["M. A. DOS SANTOS MATERIAIS PARA CONSTRUCAO LTDA.","NF",22412,918,null,"bar 150319","2019-02-28",null,"25.144.267/0001-83","NOK","2018-08-03","OK","68.347.681/0001-00","47.44-0-99","Comércio varejista de materiais de construção em geral","OK",918,"OK",null,"",null,null,null,null,"NOK"]
["RAFAEL ROSA TERRAPLENAGEM","NF",321,2204.77,null,"bar 180319","2019-02-27",null,"25.144.267/0001-83","NOK","2018-08-03","OK","26.516.006/0001-00","43.13-4-00","Obras de terraplenagem","OK",2204.77,"OK",null,"",null,null,null,null,"NOK"]
["R. P. INDUSTRIA E COMERCIO DE ARTEFATOS DE CIMENTO LTDA","NF",781,24640,null,"bar 190319","2019-03-04",null,"25.144.267/0001-83","NOK","2018-08-03","OK","14.264.380/0001-86","23.30-3-02"," Fabricação de artefatos de cimento para uso na construção","OK",24640,"OK",null,"",null,null,null,null,"NOK"]
["G.B PROJETOS - EIRELI","NF",333,3600,null,"bar 190319","2019-02-12",null,"25.144.267/0001-83","NOK","2018-08-03","OK","45.295.334/0001-78","71.12-0-00 ","Serviços de engenharia","OK",3600,"OK",null,"",null,null,null,null,"NOK"]
["ENGVISTA ENGENHARIA LTDA","NF",2211,3754,null,"bar 190319","2019-02-19",null,"25.144.267/0001-83","NOK","2018-08-03","OK","07.494.583/0001-01","71.19-7-01","Serviços de cartografia, topografia e geodésia","OK",3754,"OK",null,"",null,null,null,null,"NOK"]
["RIBEIRO & PERUCHE LTDA","NF",12244,6755,null,"bar 210319","2019-03-06",null,"25.144.267/0001-83","NOK","2018-08-03","OK","49.866.320/0001-18","47.44-0-02 ","Comércio varejista de madeira e artefatos","OK",6755,"OK",null,"",null,null,null,null,"NOK"]
["AGROMETAL COMERCIAL DE FERRAGENS LTDA","NF",77511,874,null,"bar 220319","2019-02-20",null,"25.144.267/0001-83","NOK","2018-08-03","OK","48.539.548/0007-26","47.44-0-99","Comércio varejista de materiais de construção em geral",null,874,"OK",null,"",null,null,null,null,"NOK"]
["G.B PROJETOS - EIRELI","NF",334,3600,null,"bar 220319","2019-03-14",null,"25.144.267/0001-83","NOK","2018-08-03","OK","45.295.334/0001-78","71.12-0-00 ","Serviços de engenharia",null,3600,"OK",null,"",null,null,null,null,"NOK"]
["CONSTROESTE CONSTRUTORA E PARTICIPACOES LTDA","NF",4530,11180.07,null,"bar 220319","2019-01-21",null,"25.144.267/0001-83","NOK","2018-08-03","OK","06.291.846/0004-57","42.99-5-99","Outras obras de engenharia civil não especificadas anteriormente",null,11180.07,"OK",null,"",null,null,null,null,"NOK"]
["CONSTROESTE CONSTRUTORA E PARTICIPACOES LTDA","NF",45451,3274.97,null,"bar 250319","2019-01-22",null,"25.144.267/0001-83","NOK","2018-08-03","OK","06.291.846/0004-57","42.99-5-99","Outras obras de engenharia civil não especificadas anteriormente",null,3274.97,"OK",null,"",null,null,null,null,"NOK"]
["CONSTROESTE CONSTRUTORA E PARTICIPACOES LTDA","NF",4558,13212.81,null,"bar 250319","2019-01-24",null,"25.144.267/0001-83","NOK","2018-08-03","OK","06.291.846/0004-57","42.99-5-99","Outras obras de engenharia civil não especificadas anteriormente",null,13212.81,"OK",null,"",null,null,null,null,"NOK"]
["CONSTROESTE CONSTRUTORA E PARTICIPACOES LTDA","NF",45501,5646.5,null,"bar 250319","2019-01-23",null,"25.144.267/0001-83","NOK","2018-08-03","OK","06.291.846/0004-57","42.99-5-99","Outras obras de engenharia civil não especificadas anteriormente",null,5646.5,"OK",null,"",null,null,null,null,"NOK"]
["GOL CACAMBA & TERRAPLENAGEM BARRETOS - EIRELI","NF",4561,431.2,null,"bar 250319","2019-03-13",null,"25.144.267/0001-83","NOK","2018-08-03","OK","14.794.870/0001-94","38.11-4-00 ","Coleta de resíduos não-perigosos",null,431.2,"OK",null,"","Locação de 2 caçambas de 5 metros",null,null,null,"NOK"]
["CONSTROESTE CONSTRUTORA E PARTICIPACOES LTDA","NF",45681,10728.35,null,"bar 250319","2019-01-25",null,"25.144.267/0001-83","NOK","2018-08-03","OK","06.291.846/0004-57","42.99-5-99","Outras obras de engenharia civil não especificadas anteriormente",null,10728.35,"OK",null,"",null,null,null,null,"NOK"]
["CONSTROESTE CONSTRUTORA E PARTICIPACOES LTDA","NF",47451,1473,null,"bar 270319","2019-02-25",null,"25.144.267/0001-83","NOK","2018-08-03","OK","06.291.846/0004-57","42.99-5-99","Outras obras de engenharia civil não especificadas anteriormente",null,1473,"OK",null,"",null,null,null,null,"NOK"]
["RIBEIRO & PERUCHE LTDA","NF",12270,5725.04,null,"bar 270319","2019-03-12",null,"25.144.267/0001-83","NOK","2018-08-03","OK","49.866.320/0001-18","47.44-0-02 ","Comércio varejista de madeira e artefatos",null,5725.04,"OK",null,"",null,null,null,null,"NOK"]
["CONSTROESTE CONSTRUTORA E PARTICIPACOES LTDA","NF",45751,7227.52,null,"bar 290319","2019-01-28",null,"25.144.267/0001-83","NOK","2018-08-03","OK","06.291.846/0004-57","42.99-5-99","Outras obras de engenharia civil não especificadas anteriormente",null,7227.52,"OK",null,"",null,null,null,null,"NOK"]
["CONSTROESTE CONSTRUTORA E PARTICIPACOES LTDA","NF",47621,551.88,null,"bar 290319","2019-02-27",null,"25.144.267/0001-83","NOK","2018-08-03","OK","06.291.846/0004-57","42.99-5-99","Outras obras de engenharia civil não especificadas anteriormente",null,551.88,"OK",null,"",null,null,null,null,"NOK"]
["ARCELORMITTAL BRASIL S.A.","NF",273390,120109.5,null,"bar 020519","2019-03-29",null,"25.144.267/0001-83","NOK","2018-08-03","OK","17.469.701/0045-98","46.79-6-04 "," Comércio atacadista especializado de materiais de construção não especificados anteriormente",null,120109.5,"OK",null,"",null,null,null,null,"NOK"]
["ARCELORMITTAL BRASIL S.A.","NF",273457,22288.83,null,"bar 020519","2019-03-29",null,"25.144.267/0001-83","NOK","2018-08-03","OK","17.469.701/0045-98","46.79-6-04 "," Comércio atacadista especializado de materiais de construção não especificados anteriormente",null,22288.83,"OK",null,"",null,null,null,null,"NOK"]
["NOROESTE - COMERCIO DE FERRO E ACO EIRELI","NF",83657,10508.12,null,"bar 020519","2019-04-03",null,"25.144.267/0001-83","NOK","2018-08-03","OK","08.682.259/0001-71","46.72-9-00 ","Comércio atacadista de ferragens e ferramentas",null,10508.12,"OK",null,"",null,null,null,null,"NOK"]
["ACOS GOLDONI LTDA","NF",92885,14423.13,null,"bar 020519","2019-04-25",null,"25.144.267/0001-83","NOK","2018-08-03","OK","57.958.175/0001-23","25.99-3-99 ","Fabricação de outros produtos de metal não especificados anteriormente",null,14423.13,"OK",null,{"$f":"IF(S82=\"\",\"\",IF(S82=E82,\"OK\",\"NOK\"))","v":""},null,null,null,null,"NOK"]
["FERREIRA & FERNANDES DOS SANTOS LTDA","NF",4761,2679.8,null,"bar 020519","2019-04-12",null,"25.144.267/0001-83","NOK","2018-08-03","OK","07.438.381/0001-34","47.44-0-99","Comércio varejista de materiais de construção em geral",null,2679.8,"OK",null,"",null,null,null,null,"NOK"]
["FERRAMENTAS GERAIS COMERCIO E IMPORTACAO DE FERRAMENTAS E MAQUINAS LTDA","NF",1661911,2739.9,null,"bar 020519","2019-03-19",null,"25.144.267/0001-83","NOK","2018-08-03","OK","92.664.028/0024-38","47.44-0-01","Comércio varejista de ferragens e ferramentas",null,2739.9,"OK",null,"",null,null,null,null,"NOK"]
["CLEITON JANOTA DE FREITAS 31142367827","NF",2181,5832.6,null,"bar 020519","2019-04-18",null,"25.144.267/0001-83","NOK","2018-08-03","OK","23.607.926/0001-45","43.99-1-04","Serviços de operação e fornecimento de equipamentos para transporte e elevação de cargas e pessoas para uso em obras",null,5832.6,"OK",null,"","Serviços de Guindaste para elevação das lajes",null,null,null,"NOK"]
["GERDAU ACOS LONGOS S.A.","NF",66723,23632.95,null,"bar 020519","2019-03-29",null,"25.144.267/0001-83","NOK","2018-08-03","OK","07.358.761/0195-01","46.79-6-04","Comércio atacadista especializado de materiais de construção não especificados anteriormente",null,23632.95,"OK",null,"",null,null,null,null,"NOK"]
["R. P. INDUSTRIA E COMERCIO DE ARTEFATOS DE CIMENTO LTDA","NF",798,17853.080000000002,null,"bar 020519","2019-04-18",null,"25.144.267/0001-83",{"$f":"IF(I87=\"\",\"\",IF(OR(I87=H87,LEFT(H87,10)=LEFT(I87,10)),\"OK\",\"NOK\"))","v":"NOK"},"2018-08-03",{"$f":"IF(G87=\"\",\"\",IF(G87>=K87,\"OK\",\"NOK\"))","v":"OK"},"14.264.380/0001-86","23.30-3-02"," Fabricação de artefatos de cimento para uso na construção",null,17853.080000000002,"OK",null,"",null,null,null,null,"NOK"]
["MANETONI DISTRIBUIDORA DE PRODUTOS SIDERURGICOS IMPORTACAO E EXPORTACAO LTDA","NF",643886,6934.37,null,"bar 060519","2019-03-06",null,"25.144.267/0001-83","NOK","2018-08-03","OK","49.795.800/0015-30","43.99-1-99","Serviços especializados para construção não especificados anteriormente",null,6934.37,"OK",null,"",null,null,null,null,"NOK"]
["CONSTROESTE CONSTRUTORA E PARTICIPACOES LTDA","NF",50371,1821.61,null,"bar 080519","2019-04-08",null,"25.144.267/0001-83","NOK","2018-08-03","OK","06.291.846/0004-57","42.99-5-99","Outras obras de engenharia civil não especificadas anteriormente",null,1821.61,"OK",null,"",null,null,null,null,"NOK"]
["FERRARE ASSESSORIA LTDA","NF",150,10000,null,"bar 100519","2019-05-02",null,"25.144.267/0001-83","NOK","2018-08-03","OK","16.688.405/0001-02","43.11-8-01","Demolição de edifícios e outras estruturas",null,10000,"OK",null,"","Serviço de estruturas para construção ",null,null,null,"NOK"]
["MGM DISTRIBUIDORA E COMERCIO DE PISOS EIRELI","NF",1080,1448.94,null,"bar 130519","2019-04-20",null,"25.144.267/0001-83","NOK","2018-08-03","OK","26.076.229/0001-01","47.44-0-05","Comércio varejista de materiais de construção não especificados anteriormente",null,1448.94,"OK",null,"",null,null,null,null,"NOK"]
["CONSTROESTE CONSTRUTORA E PARTICIPACOES LTDA","NF",48501,13633.89,null,"bar 130519","2019-03-13",null,"25.144.267/0001-83","NOK","2018-08-03","OK","06.291.846/0004-57","42.99-5-99","Outras obras de engenharia civil não especificadas anteriormente",null,13633.89,{"$f":"IF(Q92=\"\",\"\",IF(Q92=D92,\"OK\",\"NOK\"))","v":"OK"},null,"",null,null,null,null,"NOK"]
["CONSTROESTE CONSTRUTORA E PARTICIPACOES LTDA","NF",48491,16244.64,null,"bar 130519","2019-03-13",null,"25.144.267/0001-83","NOK",{"$f":"IF(A93=\"\",\"\",EDATE(TODAY(),-24))","v":"2018-08-03"},"OK","06.291.846/0004-57","42.99-5-99","Outras obras de engenharia civil não especificadas anteriormente",null,16244.64,"OK",null,"",null,null,null,null,{"$f":"IF(A93=\"\",\"\",IF(V93=\"OK\",\"OK\",IF(AND(J93=\"OK\",L93=\"OK\",P93=\"OK\",R93=\"OK\"),\"OK\",\"NOK\")))","v":"NOK"}]
["CONSTROESTE CONSTRUTORA E PARTICIPACOES LTDA","NF",50611,780.69,null,"bar 130519","2019-04-11",null,"25.144.267/0001-83","NOK","2018-08-03","OK","06.291.846/0004-57","42.99-5-99","Outras obras de engenharia civil não especificadas anteriormente",null,780.69,"OK",null,"",null,null,null,null,"NOK"]
["VITRAL VIDROS PLANOS LTDA","NF",474686,1347.26,null,"bar 140519","2019-04-04",null,"25.144.267/0001-83","NOK","2018-08-03",{"$f":"IF(G95=\"\",\"\",IF(G95>=K95,\"OK\",\"NOK\"))","v":"OK"},"71.821.169/0001-50","46.79-6-04","Comércio atacadista especializado de materiais de construção não especificados anteriormente",null,1347.26,"OK",null,"",null,null,null,null,"NOK"]
["VITRAL VIDROS PLANOS LTDA","NF",474683,2013.77,null,"bar 140519","2019-04-04",null,"25.144.267/0001-83","NOK","2018-08-03","OK","71.821.169/0001-50","46.79-6-04","Comércio atacadista especializado de materiais de construção não especificados anteriormente",null,2013.77,"OK",null,"",null,null,null,null,"NOK"]
["HAUS TINTAS E TEXTURAS LTDA","NF",31405,3392.91,null,"bar 140519","2019-04-19",null,"25.144.267/0001-83","NOK","2018-08-03","OK","18.177.506/0001-36","46.79-6-01","Comércio atacadista de tintas, vernizes e similares",null,3392.91,"OK",null,"",null,null,null,null,"NOK"]
["LAERCIO CARLOS MARCHIONI FABRICA DE MOVEIS DE MADEIRA","NF",14908,8064,null,"bar 160519","2019-05-08",null,"25.144.267/0001-83","NOK","2018-08-03","OK","05.487.369/0001-94","31.01-2-00 "," Fabricação de móveis com predominância de madeira",null,8064,"OK",null,"",null,null,null,null,"NOK"]
["CONSTROESTE CONSTRUTORA E PARTICIPACOES LTDA","NF",50921,3085.93,null,"bar 170519","2019-04-17",null,"25.144.267/0001-83","NOK","2018-08-03","OK","06.291.846/0004-57","42.99-5-99","Outras obras de engenharia civil não especificadas anteriormente",null,3085.93,"OK"]
["G.B PROJETOS - EIRELI","NF",336,3600,null,"bar 200519","2019-04-01",null,"25.144.267/0001-83","NOK","2018-08-03","OK","45.295.334/0001-78","71.12-0-00 ","Serviços de engenharia",null,3600,"OK",null,"",null,null,null,null,"NOK"]
["VITRAL VIDROS PLANOS LTDA","NF",475084,499.07,null,"bar 200519","2019-04-09",null,"25.144.267/0001-83","NOK","2018-08-03","OK","71.821.169/0001-50","46.79-6-04","Comércio atacadista especializado de materiais de construção não especificados anteriormente",null,499.07,"OK",null,"",null,null,null,null,"NOK"]
["VITRAL VIDROS PLANOS LTDA","NF",475054,643.6,null,"bar 200519","2019-04-09",null,"25.144.267/0001-83","NOK","2018-08-03","OK","71.821.169/0001-50","46.79-6-04","Comércio atacadista especializado de materiais de construção não especificados anteriormente",null,643.6,"OK",null,"",null,null,null,null,"NOK"]
["VITRAL VIDROS PLANOS LTDA","NF",475066,457.26,null,"bar 200519","2019-04-09",null,"25.144.267/0001-83","NOK","2018-08-03","OK","71.821.169/0001-50","46.79-6-04","Comércio atacadista especializado de materiais de construção não especificados anteriormente",null,457.26,"OK",null,"",null,null,null,null,"NOK"]
["VITRAL VIDROS PLANOS LTDA","NF",475063,1424.36,null,"bar 200519","2019-04-09",null,"25.144.267/0001-83","NOK","2018-08-03","OK","71.821.169/0001-50","46.79-6-04","Comércio atacadista especializado de materiais de construção não especificados anteriormente",null,1424.36,"OK",null,"",null,null,null,null,"NOK"]
["CONSTROESTE CONSTRUTORA E PARTICIPACOES LTDA","NF",50991,240.59,null,"bar 200519","2019-04-18",null,"25.144.267/0001-83","NOK","2018-08-03","OK","06.291.846/0004-57","42.99-5-99","Outras obras de engenharia civil não especificadas anteriormente",null,240.59,"OK",null,"",null,null,null,null,"NOK"]
["VITRAL VIDROS PLANOS LTDA","NF",477000,2031.36,null,"bar 200519","2019-04-29",null,"25.144.267/0001-83","NOK","2018-08-03","OK","71.821.169/0001-50","46.79-6-04","Comércio atacadista especializado de materiais de construção não especificados anteriormente",null,2031.36,"OK",null,"",null,null,null,null,"NOK"]
["MORADA LAR E CONSTRUCAO LTDA","NF",2531,2916.67,null,"bar 200519","2019-05-16",null,"25.144.267/0001-83","NOK","2018-08-03","OK","27.488.256/0001-46","47.44-0-99","Comércio varejista de materiais de construção em geral",null,2916.67,"OK",null,"",null,null,null,null,"NOK"]
["ANA PAULA EDUARTE - EIRELI","NF",89,3820,null,"bar 200519","2019-04-29",null,"25.144.267/0001-83","NOK","2018-08-03","OK","31.251.412/0001-28","47.41-5-00"," Comércio varejista de tintas e materiais para pintura",null,3820,"OK",null,"",null,null,null,null,"NOK"]
["CONSTROESTE CONSTRUTORA E PARTICIPACOES LTDA","NF",51051,601.47,null,"bar 230519","2019-04-23",null,"25.144.267/0001-83","NOK","2018-08-03","OK","06.291.846/0004-57","42.99-5-99","Outras obras de engenharia civil não especificadas anteriormente",null,601.47,"OK",null,"",null,null,null,null,"NOK"]
["M. A. DOS SANTOS MATERIAIS PARA CONSTRUCAO LTDA.","NF",22666,1000,null,"bar 230519","2019-05-08",null,"25.144.267/0001-83","NOK","2018-08-03","OK","68.347.681/0001-00","47.44-0-99","Comércio varejista de materiais de construção em geral",null,1000,"OK",null,"",null,null,null,null,"NOK"]
["MICHEL GUERRA CARVALHO 01186251018","NF",24447854,7140,null,"bar 280519","2019-05-28",null,"25.144.267/0001-83","NOK","2018-08-03","OK","27.527.231/0001-04","47.54-7-01 ","Comércio varejista de móveis",null,7140,"OK",null,"","Cadeiras",null,null,null,"NOK"]
["MICHEL GUERRA CARVALHO 01186251018","NF",24447918,6260,null,"bar 280519","2019-05-28",null,"25.144.267/0001-83","NOK","2018-08-03","OK","27.527.231/0001-04","47.54-7-01 ","Comércio varejista de móveis",null,6260,"OK",null,"",null,null,null,null,"NOK"]
["TREVAO HOME CENTER LTDA","NF",96505,1861.64,null,"bar 290519","2019-04-15",null,"25.144.267/0001-83","NOK","2018-08-03","OK","59.567.396/0001-04","47.44-0-05","Comércio varejista de materiais de construção não especificados anteriormente",null,1861.64,"OK",null,"",null,null,null,null,"NOK"]
["TREVAO HOME CENTER LTDA","NF",96504,905.58,null,"bar 290519","2019-04-15",null,"25.144.267/0001-83","NOK","2018-08-03","OK","59.567.396/0001-04","47.44-0-05","Comércio varejista de materiais de construção não especificados anteriormente",null,905.58,"OK",null,"",null,null,null,null,"NOK"]
["CONSTROESTE CONSTRUTORA E PARTICIPACOES LTDA","NF",51131,859.25,null,"bar 230519","2019-04-29",null,"25.144.267/0001-83","NOK","2018-08-03","OK","06.291.846/0004-57","42.99-5-99","Outras obras de engenharia civil não especificadas anteriormente",null,859.25,"OK",null,"",null,null,null,null,"NOK"]
["M. A. DOS SANTOS MATERIAIS PARA CONSTRUCAO LTDA.","NF",22686,250,null,"bar 290519","2019-05-14",null,"25.144.267/0001-83","NOK","2018-08-03","OK","68.347.681/0001-00","47.44-0-99","Comércio varejista de materiais de construção em geral",null,250,"OK",null,"",null,null,null,null,"NOK"]
["VITRAL VIDROS PLANOS LTDA","NF",478159,458.85,null,"bar 290519","2019-05-09",null,"25.144.267/0001-83","NOK","2018-08-03","OK","71.821.169/0001-50","46.79-6-04","Comércio atacadista especializado de materiais de construção não especificados anteriormente",null,458.85,"OK",null,"",null,null,null,null,"NOK"]
["VITRAL VIDROS PLANOS LTDA","NF",478285,1118.3900000000001,null,"bar 300519","2019-05-10",null,"25.144.267/0001-83","NOK","2018-08-03","OK","71.821.169/0001-50","46.79-6-04","Comércio atacadista especializado de materiais de construção não especificados anteriormente",null,1118.3900000000001,"OK",null,"",null,null,null,null,"NOK"]
["ARCELORMITTAL BRASIL S.A.","NF",2744193,1112.5,null,"bar 310519","2019-04-16",null,"25.144.267/0001-83","NOK","2018-08-03","OK","17.469.701/0045-98","46.79-6-04 "," Comércio atacadista especializado de materiais de construção não especificados anteriormente",null,1112.5,"OK",null,"",null,null,null,null,"NOK"]
["ARCELORMITTAL BRASIL S.A.","NF",274194,2314,null,"bar 310519","2019-04-16",null,"25.144.267/0001-83","NOK","2018-08-03","OK","17.469.701/0045-98","46.79-6-04 "," Comércio atacadista especializado de materiais de construção não especificados anteriormente",null,2314,"OK",null,"",null,null,null,null,"NOK"]
["CENTRO SUL INDUSTRIA E COMERCIO DE PORTAS E JANELAS LTDA.","NF",3340,1010.24,null,"bar 310519","2019-05-03",null,"25.144.267/0001-83","NOK","2018-08-03","OK","09.276.291/0001-10","46.71-1-00","Comércio atacadista de madeira e produtos derivados",null,1010.24,"OK",null,"","Porta giro / cabeceira/ lateral alizar",null,null,null,"NOK"]
["VOTORANTIM CIMENTOS S.A.","NF",219729,5070.8,null,"bar 310519","2019-05-10",null,"25.144.267/0001-83","NOK","2018-08-03","OK","01.637.895/0058-78","46.74-5-00 ","Comércio atacadista de cimento",null,5070.8,"OK",null,"",null,null,null,null,"NOK"]
["BAKOF PLASTICOS LTDA","NF",303845,18550,null,"bar 310519","2019-04-26",null,"25.144.267/0001-83","NOK","2018-08-03","OK","91.967.067/0001-55","22.29-3-03","Fabricação de artefatos de material plástico para uso na construção, exceto tubos e acessórios",null,18550,"OK",null,"",null,null,null,null,"NOK"]
["TOPPING FORROS - EIRELI","NF",12744,47151,null,"bar 310519","2019-04-17",null,"25.144.267/0001-83","NOK","2018-08-03","OK","05.145.178/0001-44","47.44-0-05 "," Comércio varejista de materiais de construção não especificados anteriormente",null,47151,"OK",null,"",null,null,null,null,"NOK"]
["INTERBRAS MATERIAIS DE ACABAMENTO LTDA","NF",198,10383.4,null,"bar 310519","2019-05-22",null,"25.144.267/0001-83","NOK","2018-08-03",{"$f":"IF(G125=\"\",\"\",IF(G125>=K125,\"OK\",\"NOK\"))","v":"OK"},"57.599.920/0001-95","47.44-0-05"," Comércio varejista de materiais de construção não especificados anteriormente",null,10383.4,"OK",null,"",null,null,null,null,"NOK"]
["CENTRO SUL INDUSTRIA E COMERCIO DE PORTAS E JANELAS LTDA.","NF",3339,3049.74,null,"bar 310519","2019-05-03",null,"25.144.267/0001-83","NOK","2018-08-03","OK","09.276.291/0001-10","46.71-1-00","Comércio atacadista de madeira e produtos derivados",null,3049.74,"OK",null,"","Porta giro / cabeceira/ lateral alizar",null,null,null,"NOK"]
["TREVAO HOME CENTER LTDA","NF",96502,817.9,null,"bar 15052019","2019-04-15",null,"25.144.267/0001-83","NOK","2018-08-03","OK","59.567.396/0001-04","47.44-0-05","Comércio varejista de materiais de construção não especificados anteriormente",null,817.9,"OK",null,"",null,null,null,null,"NOK"]
["CONSTROESTE CONSTRUTORA E PARTICIPACOES LTDA","NF",50711,520.46,null,"bar 15052019","2019-04-15",null,"25.144.267/0001-83","NOK","2018-08-03","OK","06.291.846/0004-57","42.99-5-99","Outras obras de engenharia civil não especificadas anteriormente",null,520.46,"OK",null,"",null,null,null,null,"NOK"]
["WN ARGILAS E CERAMICAS LTDA","NF",166,3360,null,"bar 15052019","2019-04-29",null,"25.144.267/0001-83","NOK","2018-08-03","OK","10.794.849/0001-38","23.42-7-02","Fabricação de artefatos de cerâmica e barro cozido para uso na construção, exceto azulejos e pisos",null,3360,"OK",null,"","Bloco Ceramico",null,null,null,"NOK"]
["MANFRIN , CASSEB & CIA LTDA","NF",55164,1858,null,"bar 15052019","2019-04-30",null,"25.144.267/0001-83","NOK","2018-08-03","OK","72.739.543/0015-31","47.41-5-00","Comércio varejista de tintas e materiais para pintura",null,1858,"OK",null,"",null,null,null,null,"NOK"]
["FERREIRA & FERNANDES DOS SANTOS LTDA","NF",4767,1232.5,null,"bar  050619","2019-05-08",null,"25.144.267/0001-83","NOK","2018-08-03","OK","07.438.381/0001-34","47.44-0-99","Comércio varejista de materiais de construção em geral",null,1232.5,"OK",null,"",null,null,null,null,"NOK"]
["VITRAL VIDROS PLANOS LTDA","NF",478849,3192.14,null,"bar  050619","2019-05-16",null,"25.144.267/0001-83","NOK","2018-08-03","OK","71.821.169/0001-50","46.79-6-04","Comércio atacadista especializado de materiais de construção não especificados anteriormente",null,3192.14,"OK",null,"",null,null,null,null,"NOK"]
["GESSO NORTE LTDA","NF",78,10875,null,"bar  050619","2019-05-23",null,"25.144.267/0001-83","NOK","2018-08-03","OK","02.084.973/0001-81","46.79-6-04","Comércio atacadista especializado de materiais de construção não especificados anteriormente",null,10875,"OK",null,"",null,null,null,null,"NOK"]
["R. P. INDUSTRIA E COMERCIO DE ARTEFATOS DE CIMENTO LTDA","NF",813,5447.8,null,"bar 060619","2019-05-22",null,"25.144.267/0001-83","NOK","2018-08-03","OK","14.264.380/0001-86","23.30-3-02"," Fabricação de artefatos de cimento para uso na construção",null,5447.8,"OK",null,"",null,null,null,null,{"$f":"IF(#REF!=\"\",\"\",IF(V134=\"OK\",\"OK\",IF(AND(J134=\"OK\",L134=\"OK\",P134=\"OK\",R134=\"OK\"),\"OK\",\"NOK\")))","v":{"$error":"#REF!"}}]
["CONSTROESTE CONSTRUTORA E PARTICIPACOES LTDA","NF",52331,1924.72,null,"bar 060619","2019-05-07",null,"25.144.267/0001-83","NOK","2018-08-03","OK","06.291.846/0004-57","42.99-5-99","Outras obras de engenharia civil não especificadas anteriormente",null,1924.72,"OK",null,"",null,null,null,null,"NOK"]
["GOL CACAMBA & TERRAPLENAGEM BARRETOS - EIRELI","NF",5081,431.2,null,"bar 100619","2019-05-28",null,"25.144.267/0001-83","NOK","2018-08-03","OK","14.794.870/0001-94","38.11-4-00 ","Coleta de resíduos não-perigosos",null,431.2,"OK",null,"","Locação de caçambas",null,null,null,{"$f":"IF(A134=\"\",\"\",IF(V136=\"OK\",\"OK\",IF(AND(J136=\"OK\",L136=\"OK\",P136=\"OK\",R136=\"OK\"),\"OK\",\"NOK\")))","v":"NOK"}]
["GOL CACAMBA & TERRAPLENAGEM BARRETOS - EIRELI","NF",5091,431.2,null,"bar 100619","2019-05-28",null,"25.144.267/0001-83","NOK","2018-08-03","OK","14.794.870/0001-94","38.11-4-00 ","Coleta de resíduos não-perigosos",null,431.2,"OK",null,"","Locação de caçambas",null,null,null,{"$f":"IF(A136=\"\",\"\",IF(V137=\"OK\",\"OK\",IF(AND(J137=\"OK\",L137=\"OK\",P137=\"OK\",R137=\"OK\"),\"OK\",\"NOK\")))","v":"NOK"}]
["GOL CACAMBA & TERRAPLENAGEM BARRETOS - EIRELI","NF",5071,646.79999999999995,null,"bar 100619","2019-05-28",null,"25.144.267/0001-83","NOK","2018-08-03","OK","14.794.870/0001-94","38.11-4-00 ","Coleta de resíduos não-perigosos",null,646.79999999999995,"OK",null,"","Locação de caçambas",null,null,null,"NOK"]
["GOL CACAMBA & TERRAPLENAGEM BARRETOS - EIRELI","NF",5061,862.4,null,"bar 100619","2019-05-28",null,"25.144.267/0001-83","NOK","2018-08-03","OK","14.794.870/0001-94","38.11-4-00 ","Coleta de resíduos não-perigosos",null,862.4,"OK",null,"","Locação de caçambas",null,null,null,"NOK"]
["JOAO APARECIDO PADILHA JUNIOR","NF",22,4274.16,null,"bar 100619","2019-05-31",null,"25.144.267/0001-83","NOK","2018-08-03","OK","10.633.726/0001-15","43.30-4-05 ","Aplicação de revestimentos e de resinas em interiores e exteriores",null,4274.16,"OK",null,"",null,null,null,null,"NOK"]
["ADOGOMAR APARECIDO DOS SANTOS 29364665805","NF",201952,3000,null,"bar 100619","2019-05-28",null,"25.144.267/0001-83","NOK","2018-08-03","OK","21.055.560/0001-13","43.21-5-00","Instalação e manutenção elétrica",null,3000,"OK",null,"",null,null,null,null,"NOK"]
["COVILAR INDUSTRIA E COMERCIO DE MOVEIS LTDA","NF",118,4000,null,"bar 110619","2019-06-04",null,"25.144.267/0001-83","NOK","2018-08-03","OK","96.367.214/0001-70","31.01-2-00 ","Fabricação de móveis com predominância de madeira",null,4000,"OK",null,"",null,null,null,null,"NOK"]
["CONSTROESTE CONSTRUTORA E PARTICIPACOES LTDA","NF",52651,274.95999999999998,null,"bar 120619","2019-05-13",null,"25.144.267/0001-83","NOK","2018-08-03","OK","06.291.846/0004-57","42.99-5-99","Outras obras de engenharia civil não especificadas anteriormente",null,274.95999999999998,{"$f":"IF(Q143=\"\",\"\",IF(Q143=D143,\"OK\",\"NOK\"))","v":"OK"},null,"",null,null,null,null,"NOK"]
["R. P. INDUSTRIA E COMERCIO DE ARTEFATOS DE CIMENTO LTDA","NF",815,18020.419999999998,null,"bar 120619","2019-05-28",null,"25.144.267/0001-83","NOK","2018-08-03","OK","14.264.380/0001-86","23.30-3-02"," Fabricação de artefatos de cimento para uso na construção",null,18020.419999999998,"OK",null,"",null,null,null,null,"NOK"]
["MICHEL GUERRA CARVALHO 01186251018","NF",24651930,7924.49,null,"bar 120619","2019-06-11",null,"25.144.267/0001-83","NOK","2018-08-03","OK","27.527.231/0001-04","47.54-7-01 ","Comércio varejista de móveis",null,7924.49,"OK",null,"",null,null,null,null,"NOK"]
["WN ARGILAS E CERAMICAS LTDA","NF",188,3840,null,"bar 130619","2019-05-24",null,"25.144.267/0001-83","NOK","2018-08-03","OK","10.794.849/0001-38","23.42-7-02","Fabricação de artefatos de cerâmica e barro cozido para uso na construção, exceto azulejos e pisos",null,3840,"OK",null,{"$f":"IF(S146=\"\",\"\",IF(S146=E146,\"OK\",\"NOK\"))","v":""},null,null,null,null,"NOK"]
["FERRARE ASSESSORIA LTDA","NF",151,10000,null,"bar 140619","2019-06-05",null,"25.144.267/0001-83","NOK","2018-08-03","OK","16.688.405/0001-02","43.11-8-01","Demolição de edifícios e outras estruturas",null,10000,"OK",null,"",null,null,null,null,"NOK"]
["MICHEL GUERRA CARVALHO 01186251018","NF",24652337,7924.49,null,"bar 180619","2019-06-11",null,"25.144.267/0001-83","NOK","2018-08-03","OK","27.527.231/0001-04","47.54-7-01 ","Comércio varejista de móveis",null,7924.49,"OK",null,"",null,null,null,null,"NOK"]
["MICHEL GUERRA CARVALHO 01186251018","NF",24652590,7978.55,null,"bar 180619","2019-06-11",null,"25.144.267/0001-83","NOK","2018-08-03","OK","27.527.231/0001-04","47.54-7-01 ","Comércio varejista de móveis",null,7978.55,"OK",null,"",null,null,null,null,"NOK"]
["MICHEL GUERRA CARVALHO 01186251018","NF",24652833,5662.2,null,"bar 180619","2019-06-11",null,"25.144.267/0001-83","NOK","2018-08-03","OK","27.527.231/0001-04","47.54-7-01 ","Comércio varejista de móveis",null,5662.2,"OK",null,"",null,null,null,null,"NOK"]
["MICHEL GUERRA CARVALHO 01186251018","NF",24652962,5995.27,null,"bar 180619","2019-06-11",null,"25.144.267/0001-83",{"$f":"IF(I151=\"\",\"\",IF(OR(I151=H151,LEFT(H151,10)=LEFT(I151,10)),\"OK\",\"NOK\"))","v":"NOK"},"2018-08-03","OK","27.527.231/0001-04","47.54-7-01 ","Comércio varejista de móveis",null,5995.27,"OK",null,"",null,null,null,null,"NOK"]
["FERREIRA & FERNANDES DOS SANTOS LTDA","NF",4798,1112.8,null,"bar 180619","2019-05-21",null,"25.144.267/0001-83","NOK","2018-08-03","OK","07.438.381/0001-34","47.44-0-99","Comércio varejista de materiais de construção em geral",null,1112.8,"OK",null,"",null,null,null,null,"NOK"]
["VITRAL VIDROS PLANOS LTDA","NF",478168,2317.73,null,"bar 180619","2019-05-09",null,"25.144.267/0001-83","NOK","2018-08-03","OK","71.821.169/0001-50","46.79-6-04","Comércio atacadista especializado de materiais de construção não especificados anteriormente",null,2317.73,"OK",null,"",null,null,null,null,"NOK"]
["VITRAL VIDROS PLANOS LTDA","NF",480373,1163.82,null,"bar 180619","2019-05-29",null,"25.144.267/0001-83","NOK","2018-08-03","OK","71.821.169/0001-50","46.79-6-04","Comércio atacadista especializado de materiais de construção não especificados anteriormente",null,1163.82,"OK",null,"",null,null,null,null,"NOK"]
["TREVAO HOME CENTER LTDA","NF",97446,2957.11,null,"bar 180619","2019-06-03",null,"25.144.267/0001-83","NOK","2018-08-03","OK","59.567.396/0001-04","47.44-0-05","Comércio varejista de materiais de construção não especificados anteriormente",null,2957.11,"OK",null,"",null,null,null,null,"NOK"]
["VITRAL VIDROS PLANOS LTDA","NF",479806,893.7,null,"bar 190619","2019-05-24",null,"25.144.267/0001-83","NOK","2018-08-03","OK","71.821.169/0001-50","46.79-6-04","Comércio atacadista especializado de materiais de construção não especificados anteriormente",null,893.7,{"$f":"IF(Q156=\"\",\"\",IF(Q156=D156,\"OK\",\"NOK\"))","v":"OK"},null,"",null,null,null,null,"NOK"]
["VITRAL VIDROS PLANOS LTDA","NF",479793,188.21,null,"bar 190619","2019-05-24",null,"25.144.267/0001-83","NOK",{"$f":"IF(A157=\"\",\"\",EDATE(TODAY(),-24))","v":"2018-08-03"},"OK","71.821.169/0001-50","46.79-6-04","Comércio atacadista especializado de materiais de construção não especificados anteriormente",null,188.21,"OK",null,"",null,null,null,null,{"$f":"IF(A157=\"\",\"\",IF(V157=\"OK\",\"OK\",IF(AND(J157=\"OK\",L157=\"OK\",P157=\"OK\",R157=\"OK\"),\"OK\",\"NOK\")))","v":"NOK"}]
["CONSTROESTE CONSTRUTORA E PARTICIPACOES LTDA","NF",53221,999.28,null,"bar 120619","2019-05-20",null,"25.144.267/0001-83","NOK","2018-08-03","OK","06.291.846/0004-57","42.99-5-99","Outras obras de engenharia civil não especificadas anteriormente",null,999.28,"OK",null,"",null,null,null,null,"NOK"]
["CONSTROESTE CONSTRUTORA E PARTICIPACOES LTDA","NF",53211,785.6,null,"bar 120619","2019-05-20",null,"25.144.267/0001-83","NOK","2018-08-03","OK","06.291.846/0004-57","42.99-5-99","Outras obras de engenharia civil não especificadas anteriormente",null,785.6,"OK",null,"",null,null,null,null,"NOK"]
["VITRAL VIDROS PLANOS LTDA","NF",480563,558.1,null,"bar 190619","2019-05-31",null,"25.144.267/0001-83","NOK","2018-08-03","OK","71.821.169/0001-50","46.79-6-04","Comércio atacadista especializado de materiais de construção não especificados anteriormente",null,558.1,"OK",null,"",null,null,null,null,"NOK"]
["VITRAL VIDROS PLANOS LTDA","NF",480561,669.47,null,"bar 190619","2019-05-31",null,"25.144.267/0001-83","NOK","2018-08-03","OK","71.821.169/0001-50","46.79-6-04","Comércio atacadista especializado de materiais de construção não especificados anteriormente",null,669.47,"OK",null,"",null,null,null,null,"NOK"]
["ELETRO TRANSOL IND E COMERCIO MAT ELETRICOS LTDA","NF",208069,1947.78,null,"bar 190619","2019-05-21",null,"25.144.267/0001-83","NOK","2018-08-03","OK","01.847.854/0002-51","46.62-1-00 ","Comércio atacadista de máquinas, equipamentos para terraplenagem, mineração e construção; partes e peças",null,1947.78,"OK",null,"",null,null,null,null,"NOK"]
["ELETRO CIDADE DE BARRETOS - EIRELI","NF",17592,13000,null,"bar 190619","2019-06-05",null,"25.144.267/0001-83","NOK","2018-08-03","OK","00.996.403/0001-32","47.42-3-00","Comércio varejista de material elétrico",null,13000,"OK",null,"",null,null,null,null,"NOK"]
["ELETRO CIDADE DE BARRETOS - EIRELI","NF",11041,3341.8,null,"bar 190619","2019-06-05",null,"25.144.267/0001-83","NOK","2018-08-03","OK","00.996.403/0001-32","47.42-3-00","Comércio varejista de material elétrico",null,3341.8,"OK",null,"",null,null,null,null,"NOK"]
["CONSTROESTE CONSTRUTORA E PARTICIPACOES LTDA","NF",53371,549.91999999999996,null,"bar 210619","2019-05-21",null,"25.144.267/0001-83","NOK","2018-08-03","OK","06.291.846/0004-57","42.99-5-99","Outras obras de engenharia civil não especificadas anteriormente",null,549.91999999999996,"OK",null,"",null,null,null,null,"NOK"]
["CARLOS R. PIMENTA","NF",791,4500,null,"bar 210619","2019-05-24",null,"25.144.267/0001-83","NOK","2018-08-03","OK","09.222.861/0001-99","77.32-2-01 ","Aluguel de máquinas e equipamentos para construção sem operador, exceto andaimes",null,4500,"OK",null,"",null,null,null,null,"NOK"]
["TUDO D'AGUA MATERIAIS PARA CONSTRUCAO LTDA.","NF",121566,3000,null,"bar 210619","2019-04-25",null,"25.144.267/0001-83","NOK","2018-08-03","OK","02.611.072/0001-09","47.44-0-99 ","Comércio varejista de materiais de construção em geral",null,3000,"OK",null,"",null,null,null,null,"NOK"]
["TOPPING FORROS - EIRELI","NF",12877,6157,null,"bar 210619","2019-05-24",null,"25.144.267/0001-83","NOK","2018-08-03","OK","05.145.178/0001-44","47.44-0-05 "," Comércio varejista de materiais de construção não especificados anteriormente",null,6157,"OK",null,"",null,null,null,null,"NOK"]
["RIACO MATERIAIS PARA CONSTRUCAO LTDA","NF",185021,500,null,"bar 210619","2019-06-08",null,"25.144.267/0001-83","NOK","2018-08-03","OK","46.917.597/0001-34","46.79-6-99","Comércio atacadista de materiais de construção em geral",null,500,"OK",null,"",null,null,null,null,"NOK"]
["VOTORANTIM CIMENTOS S.A.","NF",222297,5350.8,null,"bar 280619","2019-06-07",null,"25.144.267/0001-83","NOK","2018-08-03","OK","01.637.895/0058-78","46.74-5-00 ","Comércio atacadista de cimento",null,5350.8,"OK",null,"",null,null,null,null,"NOK"]
["MORADA LAR E CONSTRUCAO LTDA","NF",2782,2916.66,null,220719,"2019-07-17",null,"25.144.267/0001-83","NOK","2018-08-03","OK","27.488.256/0001-46","47.44-0-99","Comércio varejista de materiais de construção em geral",null,2916.66,{"$f":"IF(Q171=\"\",\"\",IF(Q171=D193,\"OK\",\"NOK\"))","v":"OK"},null,"",null,null,null,null,"NOK"]
["ANA PAULA EDUARTE - EIRELI","NF",139,23414,null,220719,"2019-07-05",null,"25.144.267/0001-83","NOK","2018-08-03","OK","31.251.412/0001-28","47.41-5-00","Comércio varejista de tintas e materiais para pintura",null,23414,"OK",null,"",null,null,null,null,{"$f":"IF(#REF!=\"\",\"\",IF(V172=\"OK\",\"OK\",IF(AND(#REF!=\"OK\",#REF!=\"OK\",#REF!=\"OK\",R172=\"OK\"),\"OK\",\"NOK\")))","v":{"$error":"#REF!"}}]
["CONSTROESTE CONSTRUTORA E PARTICIPACOES LTDA","NF",53561,982,null,220719,"2019-05-23",null,"25.144.267/0001-83","NOK","2018-08-03","OK","06.291.846/0004-57","42.99-5-99","Outras obras de engenharia civil não especificadas anteriormente",null,982,"OK",null,"",null,null,null,null,"NOK"]
["CONSTROESTE CONSTRUTORA E PARTICIPACOES LTDA","NF",53551,10409.200000000001,null,220719,"2019-05-23",null,"25.144.267/0001-83","NOK","2018-08-03","OK","06.291.846/0004-57","42.99-5-99","Outras obras de engenharia civil não especificadas anteriormente",null,10409.200000000001,{"$f":"IF(Q174=\"\",\"\",IF(Q174=D174,\"OK\",\"NOK\"))","v":"OK"},null,"",null,null,null,null,"NOK"]
["VITRAL VIDROS PLANOS LTDA","NF",481957,2503.46,null,220719,"2019-06-12",null,"25.144.267/0001-83","NOK","2018-08-03","OK","71.821.169/0001-50","46.79-6-04","Comércio atacadista especializado de materiais de construção não especificados anteriormente",null,2503.46,"OK",null,"",null,null,null,null,"NOK"]
["ELETRO CIDADE DE BARRETOS - EIRELI","NF",17598,7120,null,220719,"2019-06-07",null,"25.144.267/0001-83","NOK","2018-08-03","OK","00.996.403/0001-32","47.42-3-00","Comércio varejista de material elétrico",null,7120,"OK",null,"",null,null,null,null,"NOK"]
["CONSTROESTE CONSTRUTORA E PARTICIPACOES LTDA","NF",55641,687.4,null,220719,"2019-06-21",null,"25.144.267/0001-83","NOK","2018-08-03","OK","06.291.846/0004-57","42.99-5-99","Outras obras de engenharia civil não especificadas anteriormente",null,687.4,"OK",null,"",null,null,null,null,"NOK"]
["ARIVALDO ZOCAL - EIRELI","NF",2432,15000,null,220719,"2019-07-01",null,"25.144.267/0001-83","NOK","2018-08-03","OK","73.098.501.0001-26","47.89-0-02","Comércio varejista de plantas e flores naturais",null,15000,"OK",null,"",null,null,null,null,"NOK"]
["ARIVALDO ZOCAL - EIRELI","NF",120,3500,null,220719,"2019-07-01",null,"25.144.267/0001-83","NOK","2018-08-03","OK","73.098.501.0001-26","47.89-0-02","Comércio varejista de plantas e flores naturais",null,3500,"OK",null,{"$f":"IF(S179=\"\",\"\",IF(S179=#REF!,\"OK\",\"NOK\"))","v":""},null,null,null,null,{"$f":"IF(#REF!=\"\",\"\",IF(V179=\"OK\",\"OK\",IF(AND(#REF!=\"OK\",#REF!=\"OK\",#REF!=\"OK\",R179=\"OK\"),\"OK\",\"NOK\")))","v":{"$error":"#REF!"}}]
["CONSTROESTE CONSTRUTORA E PARTICIPACOES LTDA","NF",49451,1040.92,null,"bar 010719","2019-03-29",null,"25.144.267/0001-83","NOK","2018-08-03","OK","06.291.846/0004-57","42.99-5-99","Outras obras de engenharia civil não especificadas anteriormente",null,1040.92,"OK",null,"",null,null,null,null,"NOK"]
["CONSTROESTE CONSTRUTORA E PARTICIPACOES LTDA","NF",49361,1040.92,null,"bar 010719","2019-03-28",null,"25.144.267/0001-83","NOK","2018-08-03","OK","06.291.846/0004-57","42.99-5-99","Outras obras de engenharia civil não especificadas anteriormente",null,1040.92,"OK",null,"",null,null,null,null,"NOK"]
["CONSTROESTE CONSTRUTORA E PARTICIPACOES LTDA","NF",53431,859.25,null,"bar 010719","2019-04-29",null,"25.144.267/0001-83","NOK","2018-08-03","OK","06.291.846/0004-57","42.99-5-99","Outras obras de engenharia civil não especificadas anteriormente",null,859.25,"OK",null,"",null,null,null,null,"NOK"]
["CONSTROESTE CONSTRUTORA E PARTICIPACOES LTDA","NF",51251,17259.63,null,"bar 010719","2019-04-25",null,"25.144.267/0001-83","NOK","2018-08-03","OK","06.291.846/0004-57","42.99-5-99","Outras obras de engenharia civil não especificadas anteriormente",null,17259.63,"OK",null,"",null,null,null,null,"NOK"]
["CONSTROESTE CONSTRUTORA E PARTICIPACOES LTDA","NF",51261,1659.58,null,"bar 010719","2019-04-25",null,"25.144.267/0001-83","NOK","2018-08-03","OK","06.291.846/0004-57","42.99-5-99","Outras obras de engenharia civil não especificadas anteriormente",null,1659.58,"OK",null,"",null,null,null,null,"NOK"]
["CONSTROESTE CONSTRUTORA E PARTICIPACOES LTDA","NF",53671,761.05,null,"bar 010719","2019-05-27",null,"25.144.267/0001-83","NOK","2018-08-03","OK","06.291.846/0004-57","42.99-5-99","Outras obras de engenharia civil não especificadas anteriormente",null,761.05,"OK",null,"",null,null,null,null,"NOK"]
["CONSTROESTE CONSTRUTORA E PARTICIPACOES LTDA","NF",53661,8067.13,null,"bar 010719","2019-05-27",null,"25.144.267/0001-83","NOK","2018-08-03","OK","06.291.846/0004-57","42.99-5-99","Outras obras de engenharia civil não especificadas anteriormente",null,8067.13,"OK",null,"",null,null,null,null,"NOK"]
["IZIDIO FAUSTINO DA SILVA BARRETOS","NF",435,3500,null,"bar 010719","2019-06-17",null,"25.144.267/0001-83","NOK","2018-08-03","OK","68.998.525/0001-00","47.42-3-00","Comércio varejista de material elétrico",null,3500,"OK",null,"",null,null,null,null,"NOK"]
["ELIAS GARCIA DE SOUZA 85195057168","NF",31,5000,null,"bar 010719","2019-06-11",null,"25.144.267/0001-83","NOK","2018-08-03","OK","30.815.826/0001-70","43.30-4-04","Serviços de pintura de edifícios em geral",null,5000,"OK",null,"",null,null,null,null,"NOK"]
["CARLOS R. PIMENTA","NF",821,1000,null,"bar 010719","2019-06-26",null,"25.144.267/0001-83","NOK","2018-08-03",{"$f":"IF(G189=\"\",\"\",IF(G189>=K189,\"OK\",\"NOK\"))","v":"OK"},"09.222.861/0001-99","77.32-2-01 ","Aluguel de máquinas e equipamentos para construção sem operador, exceto andaimes",null,1000,"OK",null,"",null,null,null,null,"NOK"]
["BLB BLOCOS INDUSTRIA E COMERCIO EIRELI","NF",3357,160000,null,"bar 010719","2019-03-28",null,"25.144.267/0001-83","NOK","2018-08-03",{"$f":"IF(G190=\"\",\"\",IF(G190>=K190,\"OK\",\"NOK\"))","v":"OK"},"23.693.193/0001-09","23.30-3-02"," Fabricação de artefatos de cimento para uso na construção",null,160000,"OK",null,"",null,null,null,null,"NOK"]
["HERCILIA RIBEIRINHO BIANCHI","NF",575,2400,null,"bar 010719","2019-06-25",null,"25.144.267/0001-83","NOK","2018-08-03",{"$f":"IF(G191=\"\",\"\",IF(G191>=K191,\"OK\",\"NOK\"))","v":"OK"},"54.500.327/0001-51","47.89-0-99"," Comércio varejista de outros produtos não especificados anteriormente",null,2400,"OK",null,"","Decoração",null,null,null,"NOK"]
["JONE ANDERSON LIMA 35113280801","NF",4,9725.2199999999993,null,"bar 010719","2019-06-25",null,"25.144.267/0001-83","NOK","2018-08-03","OK","22.689.974/0001-67","31.01-2-00"," Fabricação de móveis com predominância de madeira",null,9725.2199999999993,"OK",null,"","Montagem de armário, sala de vendas barretos",null,null,null,"NOK"]
["MORADA LAR E CONSTRUCAO LTDA","NF",2670,2916.66,null,"bar 010719","2019-06-18",null,"25.144.267/0001-83","NOK","2018-08-03","OK","27.488.256/0001-46","47.44-0-99","Comércio varejista de materiais de construção em geral",null,2916.66,"OK",null,"",null,null,null,null,"NOK"]
["PASSALACQUA & CIA LTDA","NF",169927,1570,null,"bar 010719","2019-05-24",null,"25.144.267/0001-83","NOK","2018-08-03","OK","55.973.366/0019-68","47.44-0-05 ","Comércio varejista de materiais de construção não especificados anteriormente",null,1570,"OK",null,"",null,null,null,null,"NOK"]
["CONSTROESTE CONSTRUTORA E PARTICIPACOES LTDA","NF",54421,1787.24,null,"bar 010719","2019-06-04",null,"25.144.267/0001-83","NOK","2018-08-03","OK","06.291.846/0004-57","42.99-5-99","Outras obras de engenharia civil não especificadas anteriormente",null,1787.24,"OK",null,"",null,null,null,null,"NOK"]
["TREVAO HOME CENTER LTDA","NF",97488,1510.97,null,"bar 050719","2019-06-05",null,"25.144.267/0001-83","NOK","2018-08-03","OK","59.567.396/0001-04","47.44-0-05","Comércio varejista de materiais de construção não especificados anteriormente",null,1510.97,"OK",null,"",null,null,null,null,"NOK"]
["ERIVELTO DOS SANTOS FONSECA TERRAPLANAGEM","NF",101,2156,null,"bar 080719","2019-06-14",null,"25.144.267/0001-83","NOK","2018-08-03","OK","31.716.556/0001-02","43.13-4-00","Obras de terraplenagem",null,2156,"OK",null,"",null,null,null,null,"NOK"]
["CLEITON JANOTA DE FREITAS 31142367827","NF",2411,6804.7,null,"bar 080719","2019-06-24",null,"25.144.267/0001-83","NOK","2018-08-03","OK","23.607.926/0001-45","43.99-1-04","Serviços de operação e fornecimento de equipamentos para transporte e elevação de cargas e pessoas para uso em obras",null,6804.7,"OK",null,"",null,null,null,null,"NOK"]
["ANA PAULA EDUARTE - EIRELI","NF",132,5034,null,"bar 100719","2019-06-25",null,"25.144.267/0001-83","NOK","2018-08-03","OK","31.251.412/0001-28","47.41-5-00","Comércio varejista de tintas e materiais para pintura",null,5034,"OK",null,"",null,null,null,null,"NOK"]
["ANA PAULA EDUARTE - EIRELI","NF",130,29953,null,"bar 100719","2019-06-25",null,"25.144.267/0001-83","NOK","2018-08-03","OK","31.251.412/0001-28","47.41-5-00","Comércio varejista de tintas e materiais para pintura",null,29953,"OK",null,"",null,null,null,null,"NOK"]
["CONSTROESTE CONSTRUTORA E PARTICIPACOES LTDA","NF",52551,1237.32,null,"bar 100719","2019-05-10",null,"25.144.267/0001-83","NOK","2018-08-03","OK","06.291.846/0004-57","42.99-5-99","Outras obras de engenharia civil não especificadas anteriormente",null,1237.32,"OK",null,"",null,null,null,null,"NOK"]
["RIACO MATERIAIS PARA CONSTRUCAO LTDA","NF",184023,1372.11,null,"bar 100719","2019-05-25",null,"25.144.267/0001-83","NOK","2018-08-03","OK","46.917.597/0001-34","46.79-6-99","Comércio atacadista de materiais de construção em geral",null,1372.11,"OK",null,"",null,null,null,null,"NOK"]
["COMAP MATERIAIS PARA CONSTRUCOES LTDA","NF",45662,1164.25,null,"bar 100719","2019-06-25",null,"25.144.267/0001-83","NOK","2018-08-03","OK","48.447.627/0001-11","47.44-0-05"," Comércio varejista de materiais de construção não especificados anteriormente",null,1164.25,"OK",null,"",null,null,null,null,"NOK"]
["COMAP MATERIAIS PARA CONSTRUCOES LTDA","NF",45661,905.64,null,"bar 100719","2019-06-25",null,"25.144.267/0001-83","NOK","2018-08-03","OK","48.447.627/0001-11","47.44-0-05"," Comércio varejista de materiais de construção não especificados anteriormente",null,905.64,"OK",null,"",null,null,null,null,"NOK"]
["COMAP MATERIAIS PARA CONSTRUCOES LTDA","NF",45660,244.2,null,"bar 100719","2019-06-25",null,"25.144.267/0001-83","NOK","2018-08-03","OK","48.447.627/0001-11","47.44-0-05"," Comércio varejista de materiais de construção não especificados anteriormente",null,244.2,"OK",null,"",null,null,null,null,"NOK"]
["MA STEEL INDUSTRIA DE ESTRUTURA METALICA EIRELI","NF",914,52513.36,null,"bar 120719","2019-06-12",null,"25.144.267/0001-83","NOK","2018-08-03","OK","18.038.966/0001-83","41.20-4-00"," Construção de edifícios",null,52513.36,"OK",null,"",null,null,null,null,"NOK"]
["VIDRACARIA CAIEL EIRELI","NF",3931,1750,null,"bar 120719","2019-06-11",null,"25.144.267/0001-83","NOK","2018-08-03","OK","02.328.994/0001-03","47.43-1-00"," Comércio varejista de vidros",null,1750,"OK",null,"",null,null,null,null,"NOK"]
["CONSTROESTE CONSTRUTORA E PARTICIPACOES LTDA","NF",50821,650.57000000000005,null,"bar 150719","2019-04-16",null,"25.144.267/0001-83","NOK","2018-08-03","OK","06.291.846/0004-57","42.99-5-99","Outras obras de engenharia civil não especificadas anteriormente",null,650.57000000000005,"OK",null,"",null,null,null,null,"NOK"]
["VITRAL VIDROS PLANOS LTDA","NF",481145,3217.18,null,"bar 150719","2019-06-05",null,"25.144.267/0001-83","NOK","2018-08-03","OK","71.821.169/0001-50","46.79-6-04","Comércio atacadista especializado de materiais de construção não especificados anteriormente",null,3217.18,"OK",null,"",null,null,null,null,"NOK"]
["VITRAL VIDROS PLANOS LTDA","NF",480981,854.97,null,"bar 150719","2019-06-04",null,"25.144.267/0001-83","NOK","2018-08-03","OK","71.821.169/0001-50","46.79-6-04","Comércio atacadista especializado de materiais de construção não especificados anteriormente",null,854.97,"OK",null,{"$f":"IF(S210=\"\",\"\",IF(S210=E210,\"OK\",\"NOK\"))","v":""},null,null,null,null,"NOK"]
["RIACO MATERIAIS PARA CONSTRUCAO LTDA","NF",148408,1150,null,"bar 150719","2019-05-31",null,"25.144.267/0001-83","NOK","2018-08-03","OK","46.917.597/0001-34","46.79-6-99","Comércio atacadista de materiais de construção em geral",null,1150,"OK",null,{"$f":"IF(S211=\"\",\"\",IF(S211=E211,\"OK\",\"NOK\"))","v":""},null,null,null,null,"NOK"]
["CONSTROESTE CONSTRUTORA E PARTICIPACOES LTDA","NF",55141,1374.8,null,"bar 150719","2019-06-14",null,"25.144.267/0001-83","NOK","2018-08-03","OK","06.291.846/0004-57","42.99-5-99","Outras obras de engenharia civil não especificadas anteriormente",null,1374.8,"OK",null,{"$f":"IF(S212=\"\",\"\",IF(S212=E212,\"OK\",\"NOK\"))","v":""},null,null,null,null,"NOK"]
["WGR CONSTRUTORA E INCORPORADORA - SPE 02 OLIMPIA LTDA","NF",61,2502.4,null,"bar 150719","2019-07-02",null,"25.144.267/0001-83","NOK","2018-08-03","OK","17.191.725/0001-07","41.20-4-00","Construção de edifícios",null,2502.4,"OK",null,{"$f":"IF(S213=\"\",\"\",IF(S213=E213,\"OK\",\"NOK\"))","v":""},null,null,null,null,"NOK"]
["WGR CONSTRUTORA E INCORPORADORA - SPE 02 OLIMPIA LTDA","NF",60,1659.16,null,"bar 150719","2019-04-22",null,"25.144.267/0001-83","NOK","2018-08-03","OK","17.191.725/0001-07","41.20-4-00","Construção de edifícios",null,1659.16,"OK",null,{"$f":"IF(S214=\"\",\"\",IF(S214=E214,\"OK\",\"NOK\"))","v":""},null,null,null,null,"NOK"]
["ELIAS GARCIA DE SOUZA 85195057168","NF",39,11000,null,"bar 150719","2019-07-03",null,"25.144.267/0001-83",{"$f":"IF(I215=\"\",\"\",IF(OR(I215=H215,LEFT(H215,10)=LEFT(I215,10)),\"OK\",\"NOK\"))","v":"NOK"},"2018-08-03","OK","30.815.826/0001-70","43.30-4-04","Serviços de pintura de edifícios em geral",null,11000,"OK",null,"",null,null,null,null,"NOK"]
["FERRARE ASSESSORIA LTDA","NF",155,11000,null,"bar 150719","2019-07-08",null,"25.144.267/0001-83","NOK","2018-08-03","OK","16.688.405/0001-02","43.11-8-01","Demolição de edifícios e outras estruturas",null,11000,"OK",null,"",null,null,null,null,"NOK"]
["CONSTROESTE CONSTRUTORA E PARTICIPACOES LTDA","NF",53101,9400.7999999999993,null,"bar 160719","2019-05-17",null,"25.144.267/0001-83","NOK","2018-08-03","OK","06.291.846/0004-57","42.99-5-99","Outras obras de engenharia civil não especificadas anteriormente",null,9400.7999999999993,"OK",null,"",null,null,null,null,"NOK"]
["BERGAMO EXTRACAO DE AREIA E PRESTACAO DE SERVICOS LTDA","NF",10095,788.15,null,"bar 160719","2019-06-07",null,"25.144.267/0001-83","NOK","2018-08-03","OK","22.504.773/0001-48","43.13-4-00"," Obras de terraplenagem",null,788.15,"OK",null,"",null,null,null,null,"NOK"]
["VITRAL VIDROS PLANOS LTDA","NF",481284,3182.64,null,"bar 160719","2019-06-06",null,"25.144.267/0001-83","NOK","2018-08-03","OK","71.821.169/0001-50","46.79-6-04","Comércio atacadista especializado de materiais de construção não especificados anteriormente",null,3182.64,"OK",null,"",null,null,null,null,"NOK"]
["BERGAMO EXTRACAO DE AREIA E PRESTACAO DE SERVICOS LTDA","NF",10096,808.5,null,"bar 170719","2019-06-07",null,"25.144.267/0001-83","NOK","2018-08-03","OK","22.504.773/0001-48","43.13-4-00"," Obras de terraplenagem",null,808.5,{"$f":"IF(Q220=\"\",\"\",IF(Q220=D220,\"OK\",\"NOK\"))","v":"OK"},null,"",null,null,null,null,"NOK"]
["CONSTROESTE CONSTRUTORA E PARTICIPACOES LTDA","NF",55301,687.4,null,"bar 170719","2019-06-17",null,"25.144.267/0001-83","NOK",{"$f":"IF(A221=\"\",\"\",EDATE(TODAY(),-24))","v":"2018-08-03"},"OK","06.291.846/0004-57","42.99-5-99","Outras obras de engenharia civil não especificadas anteriormente",null,687.4,"OK",null,"",null,null,null,null,{"$f":"IF(A221=\"\",\"\",IF(V221=\"OK\",\"OK\",IF(AND(J221=\"OK\",L221=\"OK\",P221=\"OK\",R221=\"OK\"),\"OK\",\"NOK\")))","v":"NOK"}]
["CONSTROESTE CONSTRUTORA E PARTICIPACOES LTDA","NF",55501,549.91999999999996,null,"bar 190719","2019-06-19",null,"25.144.267/0001-83","NOK","2018-08-03","OK","06.291.846/0004-57","42.99-5-99","Outras obras de engenharia civil não especificadas anteriormente",null,549.91999999999996,"OK",null,"",null,null,null,null,{"$f":"IF(#REF!=\"\",\"\",IF(V222=\"OK\",\"OK\",IF(AND(J222=\"OK\",L222=\"OK\",P222=\"OK\",R222=\"OK\"),\"OK\",\"NOK\")))","v":{"$error":"#REF!"}}]
["FERREIRA & FERNANDES DOS SANTOS LTDA","NF",4851,1272,null,"bar 250719","2019-07-10",null,"25.144.267/0001-83","NOK","2018-08-03","OK","07.438.381/0001-34","47.44-0-99","Comércio varejista de materiais de construção em geral",null,1272,"OK",null,"",null,null,null,null,"NOK"]
["FERREIRA & FERNANDES DOS SANTOS LTDA","NF",4850,1519,null,"bar 250719","2019-07-10",null,"25.144.267/0001-83","NOK","2018-08-03","OK","07.438.381/0001-34","47.44-0-99","Comércio varejista de materiais de construção em geral",null,1519,"OK",null,"",null,null,null,null,"NOK"]
["FERREIRA & FERNANDES DOS SANTOS LTDA","NF",4852,1343,null,"bar 250719","2019-07-10",null,"25.144.267/0001-83","NOK","2018-08-03","OK","07.438.381/0001-34","47.44-0-99","Comércio varejista de materiais de construção em geral",null,1343,"OK",null,"",null,null,null,null,"NOK"]
["TUDO D'AGUA MATERIAIS PARA CONSTRUCAO LTDA.","NF",122678,40852.370000000003,null,"bar 260719","2019-05-24",null,"25.144.267/0001-83","NOK","2018-08-03","OK","02.611.072/0001-09","47.44-0-99 ","Comércio varejista de materiais de construção em geral",null,40852.370000000003,"OK",null,"",null,null,null,null,"NOK"]
["CONSTROESTE CONSTRUTORA E PARTICIPACOES LTDA","NF",51431,859.25,null,"bar 290719","2019-04-29",null,"25.144.267/0001-83","NOK","2018-08-03","OK","06.291.846/0004-57","42.99-5-99","Outras obras de engenharia civil não especificadas anteriormente",null,859.25,"OK",null,"",null,null,null,null,"NOK"]
["CONSTROESTE CONSTRUTORA E PARTICIPACOES LTDA","NF",56001,18892.7,null,"bar 290719","2019-06-27",null,"25.144.267/0001-83","NOK","2018-08-03","OK","06.291.846/0004-57","42.99-5-99","Outras obras de engenharia civil não especificadas anteriormente",null,18892.7,"OK",null,"",null,null,null,null,"NOK"]
["CONSTROESTE CONSTRUTORA E PARTICIPACOES LTDA","NF",56011,1730.77,null,"bar 290719","2019-06-27",null,"25.144.267/0001-83","NOK","2018-08-03","OK","06.291.846/0004-57","42.99-5-99","Outras obras de engenharia civil não especificadas anteriormente",null,1730.77,"OK",null,"",null,null,null,null,"NOK"]
["GUAIRA COMERCIO DE TINTAS LTDA","NF",1724,930,null,"bar 290719","2019-07-03",null,"25.144.267/0001-83","NOK","2018-08-03","OK","72.697.501/0003-41","47.41-5-00 "," Comércio varejista de tintas e materiais para pintura",null,930,"OK",null,"",null,null,null,null,"NOK"]
["E. LOPES DA SILVA MONTAGENS INDUSTRIAIS","NF",147,4712.5,null,"bar 290719","2019-07-11",null,"25.144.267/0001-83","NOK","2018-08-03","OK","28.822.846/0001-26","47.44-0-99","Comércio varejista de materiais de construção em geral",null,4712.5,"OK",null,"",null,null,null,null,"NOK"]
["GOL BARRETOS CONSTRUCOES - EIRELI","NF",101,646.79999999999995,null,"bar 290719","2019-07-11",null,"25.144.267/0001-83","NOK","2018-08-03","OK","33.930.372/0001-76","38.11-4-00","Coleta de resíduos não-perigosos",null,646.79999999999995,"OK",null,"","Locação de três caçambas de 5 metros - Obra Prédio",null,null,null,"NOK"]
["GOL BARRETOS CONSTRUCOES - EIRELI","NF",111,1509.2,null,"bar 290719","2019-07-11",null,"25.144.267/0001-83","NOK","2018-08-03","OK","33.930.372/0001-76","38.11-4-00","Coleta de resíduos não-perigosos",null,1509.2,"OK",null,"","Locação de três caçambas de 5 metros - Obra sala de vendas",null,null,null,"NOK"]
["CARLOS R. PIMENTA","NF",871,11000,null,"bar 290719","2019-07-29",null,"25.144.267/0001-83","NOK","2018-08-03","OK","09.222.861/0001-99","77.32-2-01 ","Aluguel de máquinas e equipamentos para construção sem operador, exceto andaimes",null,11000,"OK",null,"",null,null,null,null,"NOK"]
["RIACO MATERIAIS PARA CONSTRUCAO LTDA","NF",186729,2679.57,null,"bar 310719","2019-07-10",null,"25.144.267/0001-83","NOK","2018-08-03","OK","46.917.597/0001-34","46.79-6-99","Comércio atacadista de materiais de construção em geral",null,2679.57,"OK",null,"",null,null,null,null,"NOK"]
["TREVAO HOME CENTER LTDA","NF",98341,2400,null,"bar 010819","2019-07-17",null,"25.144.267/0001-83","NOK","2018-08-03","OK","59.567.396/0001-04","47.44-0-05","Comércio varejista de materiais de construção não especificados anteriormente",null,2400,"OK",null,"",null,null,null,null,"NOK"]
["ERIVELTO DOS SANTOS FONSECA TERRAPLANAGEM","NF",131,5772.2,null,"bar 050819","2019-07-17",null,"25.144.267/0001-83","NOK","2018-08-03","OK","31.716.556/0001-02","43.13-4-00"," Obras de terraplenagem",null,5772.2,"OK",null,"",null,null,null,null,"NOK"]
["GESSO NORTE LTDA","NF",185,17286.36,null,"bar 050819","2019-07-23",null,"25.144.267/0001-83","NOK","2018-08-03","OK","02.084.973/0001-81","46.79-6-04","Comércio atacadista especializado de materiais de construção não especificados anteriormente",null,17286.36,"OK",null,"",null,null,null,null,"NOK"]
["TUDO D'AGUA MATERIAIS PARA CONSTRUCAO LTDA.","NF",124858,4848.3999999999996,null,"bar 050819","2019-07-04",null,"25.144.267/0001-83","NOK","2018-08-03","OK","02.611.072/0001-09","47.44-0-99 ","Comércio varejista de materiais de construção em geral",null,4848.3999999999996,"OK",null,"",null,null,null,null,"NOK"]
["CONSTROESTE CONSTRUTORA E PARTICIPACOES LTDA","NF",54671,842.06,null,"bar 060819","2019-06-07",null,"25.144.267/0001-83","NOK","2018-08-03","OK","06.291.846/0004-57","42.99-5-99","Outras obras de engenharia civil não especificadas anteriormente",null,842.06,"OK",null,"",null,null,null,null,"NOK"]
["CONSTROESTE CONSTRUTORA E PARTICIPACOES LTDA","NF",56871,1099.8399999999999,null,"bar 070819","2019-07-08",null,"25.144.267/0001-83","NOK","2018-08-03","OK","06.291.846/0004-57","42.99-5-99","Outras obras de engenharia civil não especificadas anteriormente",null,1099.8399999999999,"OK",null,"",null,null,null,null,"NOK"]
["HIPOLITO ELETRICA COMERCIO E SERVICOS DE GUINCHO LTDA","NF",5401,3339,null,"bar 070819","2019-06-07",null,"25.144.267/0001-83","NOK","2018-08-03","OK","12.329.156/0001-08","47.42-3-00","Comércio varejista de material elétrico",null,3339,"OK",null,"",null,null,null,null,"NOK"]
["VOTORANTIM CIMENTOS S.A.","NF",225820,4947.6000000000004,null,"bar 080819","2019-07-18",null,"25.144.267/0001-83","NOK","2018-08-03",{"$f":"IF(G243=\"\",\"\",IF(G243>=K243,\"OK\",\"NOK\"))","v":"OK"},"01.637.895/0058-78","46.74-5-00 ","Comércio atacadista de cimento",null,4947.6000000000004,"OK",null,"",null,null,null,null,"NOK"]
["HIPOLITO ELETRICA COMERCIO E SERVICOS DE GUINCHO LTDA","NF",5496,488.86,null,"bar 080819","2019-07-08",null,"25.144.267/0001-83","NOK","2018-08-03","OK","12.329.156/0001-08","47.42-3-00","Comércio varejista de material elétrico",null,488.86,"OK",null,"",null,null,null,null,"NOK"]
["CLEITON JANOTA DE FREITAS 31142367827","NF",2521,7096.33,null,"bar 090819","2019-07-22",null,"25.144.267/0001-83","NOK","2018-08-03","OK","23.607.926/0001-45","43.99-1-04","Serviços de operação e fornecimento de equipamentos para transporte e elevação de cargas e pessoas para uso em obras",null,7096.33,"OK",null,"",null,null,null,null,"NOK"]
["TUDO D'AGUA MATERIAIS PARA CONSTRUCAO LTDA.","NF",125040,2021.03,null,"bar 120819","2019-07-11",null,"25.144.267/0001-83","NOK","2018-08-03","OK","02.611.072/0001-09","47.44-0-99 ","Comércio varejista de materiais de construção em geral",null,2021.03,"OK",null,"",null,null,null,null,"NOK"]
["MANFRIN , CASSEB & CIA LTDA","NF",56818,1420,null,"bar 120819","2019-06-11",null,"25.144.267/0001-83","NOK","2018-08-03","OK","72.739.543/0015-31","47.41-5-00","Comércio varejista de tintas e materiais para pintura",null,1420,"OK",null,"",null,null,null,null,"NOK"]
["ANA PAULA EDUARTE - EIRELI","NF",158,1920,null,"bar 120819","2019-07-22",null,"25.144.267/0001-83","NOK","2018-08-03","OK","31.251.412/0001-28","47.41-5-00","Comércio varejista de tintas e materiais para pintura",null,1920,"OK",null,"",null,null,null,null,"NOK"]
["CONSTROESTE CONSTRUTORA E PARTICIPACOES LTDA","NF",57181,1924.72,null,"bar 120819","2019-07-12",null,"25.144.267/0001-83","NOK","2018-08-03","OK","06.291.846/0004-57","42.99-5-99","Outras obras de engenharia civil não especificadas anteriormente",null,1924.72,"OK",null,"",null,null,null,null,"NOK"]
["CONSTROESTE CONSTRUTORA E PARTICIPACOES LTDA","NF",57671,824.88,null,"bar 120819","2019-07-18",null,"25.144.267/0001-83","NOK","2018-08-03","OK","06.291.846/0004-57","42.99-5-99","Outras obras de engenharia civil não especificadas anteriormente",null,824.88,"OK",null,"",null,null,null,null,"NOK"]
["CONSTROESTE CONSTRUTORA E PARTICIPACOES LTDA","NF",12191,325.62,null,"bar 120819","2019-05-17",null,"25.144.267/0001-83","NOK","2018-08-03","OK","06.291.846/0004-57","42.99-5-99","Outras obras de engenharia civil não especificadas anteriormente",null,325.62,"OK",null,"",null,null,null,null,"NOK"]
["TUDO D'AGUA MATERIAIS PARA CONSTRUCAO LTDA.","NF",126096,1150,null,"bar 130819","2019-07-29",null,"25.144.267/0001-83","NOK","2018-08-03","OK","02.611.072/0001-09","47.44-0-99 ","Comércio varejista de materiais de construção em geral",null,1150,{"$f":"IF(#REF!=\"\",\"\",IF(#REF!=D252,\"OK\",\"NOK\"))","v":{"$error":"#REF!"}},null,"",null,null,null,null,{"$f":"IF(A252=\"\",\"\",IF(V252=\"OK\",\"OK\",IF(AND(J252=\"OK\",L252=\"OK\",Q252=\"OK\",R252=\"OK\"),\"OK\",\"NOK\")))","v":{"$error":"#REF!"}}]
["FERRARE ASSESSORIA LTDA","NF",157,11000,null,"bar 140819","2019-08-02",null,"25.144.267/0001-83","NOK","2018-08-03","OK","16.688.405/0001-02","43.11-8-01","Demolição de edifícios e outras estruturas",null,11000,"OK",null,"",null,null,null,null,"NOK"]
["CONSTROESTE CONSTRUTORA E PARTICIPACOES LTDA","NF",57751,10013.65,null,"bar 190819","2019-07-19",null,"25.144.267/0001-83","NOK","2018-08-03","OK","06.291.846/0004-57","42.99-5-99","Outras obras de engenharia civil não especificadas anteriormente",null,10013.65,"OK",null,"",null,null,null,null,"NOK"]
["CONSTROESTE CONSTRUTORA E PARTICIPACOES LTDA","NF",57761,925,null,"bar 190819","2019-07-19",null,"25.144.267/0001-83","NOK","2018-08-03","OK","06.291.846/0004-57","42.99-5-99","Outras obras de engenharia civil não especificadas anteriormente",null,925,"OK",null,"",null,null,null,null,"NOK"]
["CONSTROESTE CONSTRUTORA E PARTICIPACOES LTDA","NF",57971,16508.990000000002,null,"bar 220819","2019-07-23",null,"25.144.267/0001-83","NOK","2018-08-03","OK","06.291.846/0004-57","42.99-5-99","Outras obras de engenharia civil não especificadas anteriormente",null,16508.990000000002,"OK",null,"",null,null,null,null,"NOK"]
["CONSTROESTE CONSTRUTORA E PARTICIPACOES LTDA","NF",57981,1497.55,null,"bar 220819","2019-07-23",null,"25.144.267/0001-83","NOK","2018-08-03","OK","06.291.846/0004-57","42.99-5-99","Outras obras de engenharia civil não especificadas anteriormente",null,1497.55,"OK",null,"",null,null,null,null,"NOK"]
["CONSTROESTE CONSTRUTORA E PARTICIPACOES LTDA","NF",58111,811.92,null,"bar 230819","2019-07-24",null,"25.144.267/0001-83","NOK","2018-08-03","OK","06.291.846/0004-57","42.99-5-99","Outras obras de engenharia civil não especificadas anteriormente",null,811.92,"OK",null,"",null,null,null,null,"NOK"]
["ANA PAULA EDUARTE - EIRELI","NF",188,17920,null,"bar 260819","2019-08-16",null,"25.144.267/0001-83","NOK","2018-08-03","OK","31.251.412/0001-28","47.41-5-00","Comércio varejista de tintas e materiais para pintura",null,17920,"OK",null,"",null,null,null,null,"NOK"]
["MILIMETRO COMERCIO DE FERRAGENS E ACESSORIOS LTDA","NF",3504,2910,null,"bar 020919","2019-07-05",null,"25.144.267/0001-83","NOK","2018-08-03","OK","11.134.323/0001-94","47.44-0-01","Comércio varejista de ferragens e ferramentas",null,2910,"OK",null,"",null,null,null,null,"NOK"]
["MILIMETRO COMERCIO DE FERRAGENS E ACESSORIOS LTDA","NF",3505,2560,null,"bar 020919","2019-07-05",null,"25.144.267/0001-83","NOK","2018-08-03","OK","11.134.323/0001-94","47.44-0-01","Comércio varejista de ferragens e ferramentas",null,2560,"OK",null,"",null,null,null,null,"NOK"]
["CLEITON JANOTA DE FREITAS 31142367827","NF",2671,7096.33,null,"bar 020919","2019-08-16",null,"25.144.267/0001-83","NOK","2018-08-03","OK","23.607.926/0001-45","43.99-1-04","Serviços de operação e fornecimento de equipamentos para transporte e elevação de cargas e pessoas para uso em obras",null,7096.33,"OK",null,"",null,null,null,null,"NOK"]
["MILIMETRO COMERCIO DE FERRAGENS E ACESSORIOS LTDA","NF",3471,28390.6,null,"bar 020919","2019-06-14",null,"25.144.267/0001-83","NOK","2018-08-03","OK","11.134.323/0001-94","47.44-0-01","Comércio varejista de ferragens e ferramentas",null,28390.6,"OK",null,"",null,null,null,null,"NOK"]
["VOTORANTIM CIMENTOS S.A.","NF",228232,4947.6000000000004,null,"bar 030919","2019-08-13",null,"25.144.267/0001-83","NOK","2018-08-03","OK","01.637.895/0058-78","46.74-5-00 ","Comércio atacadista de cimento",null,4947.6000000000004,"OK",null,"",null,null,null,null,"NOK"]
["CONSTROESTE CONSTRUTORA E PARTICIPACOES LTDA","NF",58791,780.69,null,"bar 050919","2019-08-06",null,"25.144.267/0001-83","NOK","2018-08-03","OK","06.291.846/0004-57","42.99-5-99","Outras obras de engenharia civil não especificadas anteriormente",null,780.69,"OK",null,"",null,null,null,null,"NOK"]
["CONSTROESTE CONSTRUTORA E PARTICIPACOES LTDA","NF",58991,520.46,null,"bar 050919","2019-08-06",null,"25.144.267/0001-83","NOK","2018-08-03","OK","06.291.846/0004-57","42.99-5-99","Outras obras de engenharia civil não especificadas anteriormente",null,520.46,"OK",null,"",null,null,null,null,"NOK"]
["CONSTROESTE CONSTRUTORA E PARTICIPACOES LTDA","NF",59271,1171.03,null,"bar 050919","2019-08-07",null,"25.144.267/0001-83","NOK","2018-08-03","OK","06.291.846/0004-57","42.99-5-99","Outras obras de engenharia civil não especificadas anteriormente",null,1171.03,"OK",null,"",null,null,null,null,"NOK"]
["R. P. INDUSTRIA E COMERCIO DE ARTEFATOS DE CIMENTO LTDA","NF",824,18682.310000000001,null,"bar 090919","2019-06-27",null,"25.144.267/0001-83","NOK","2018-08-03","OK","14.264.380/0001-86","23.30-3-02"," Fabricação de artefatos de cimento para uso na construção",null,18682.310000000001,"OK",null,"",null,null,null,null,"NOK"]
["R. P. INDUSTRIA E COMERCIO DE ARTEFATOS DE CIMENTO LTDA","NF",867,18755.919999999998,null,"bar 090919","2019-08-26",null,"25.144.267/0001-83","NOK","2018-08-03","OK","14.264.380/0001-86","23.30-3-02"," Fabricação de artefatos de cimento para uso na construção",null,18755.919999999998,"OK",null,"",null,null,null,null,"NOK"]
["ALAIR MUNIZ DUTRA E FILHOS EXTRACAO LTDA","NF",14279,880,null,"bar 120919","2019-08-13",null,"25.144.267/0001-83","NOK","2018-08-03","OK","10.727.024/0001-09","08.10-0-06","Extração de areia, cascalho ou pedregulho e beneficiamento associado",null,880,"OK",null,"","Areia grossa",null,null,null,"NOK"]
["ELIANE REVESTIMENTOS CERAMICOS LTDA","NF",943983,11804.8,null,"bar 130919","2019-08-16",null,"25.144.267/0001-83","NOK","2018-08-03","OK","86.532.538/0032-69","23.42-7-01","Fabricação de azulejos e pisos",null,11804.8,"OK",null,"","Piso Ceramico",null,null,null,"NOK"]
["CONSTROESTE CONSTRUTORA E PARTICIPACOES LTDA","NF",59791,650.57000000000005,null,"bar 130919","2019-08-14",null,"25.144.267/0001-83","NOK","2018-08-03","OK","06.291.846/0004-57","42.99-5-99","Outras obras de engenharia civil não especificadas anteriormente",null,650.57000000000005,"OK",null,"",null,null,null,null,"NOK"]
["WN ARGILAS E CERAMICAS LTDA","NF",269,3141.6,null,"bar 130919","2019-08-28",null,"25.144.267/0001-83","NOK","2018-08-03","OK","10.794.849/0001-38","23.42-7-02","Fabricação de artefatos de cerâmica e barro cozido para uso na construção, exceto azulejos e pisos",null,3141.6,"OK",null,"",null,null,null,null,"NOK"]
["FERRARE ASSESSORIA LTDA","NF",160,11000,null,"bar 130919","2019-09-04",null,"25.144.267/0001-83","NOK","2018-08-03","OK","16.688.405/0001-02","43.11-8-01","Demolição de edifícios e outras estruturas",null,11000,"OK",null,{"$f":"IF(S274=\"\",\"\",IF(S274=E274,\"OK\",\"NOK\"))","v":""},null,null,null,null,"NOK"]
["ELIAS GARCIA DE SOUZA 85195057168","NF",40,2500,null,"bar 160919","2019-09-05",null,"25.144.267/0001-83","NOK","2018-08-03","OK","30.815.826/0001-70","43.30-4-04","Serviços de pintura de edifícios em geral",null,2500,"OK",null,"",null,null,null,null,"NOK"]
["ELIAS GARCIA DE SOUZA 85195057168","NF",50,3500,null,"bar 160919","2019-09-05",null,"25.144.267/0001-83","NOK","2018-08-03","OK","30.815.826/0001-70","43.30-4-04","Serviços de pintura de edifícios em geral",null,3500,"OK",null,"",null,null,null,null,"NOK"]
["ANA PAULA EDUARTE - EIRELI","NF",189,1308,null,"bar 160919","2019-08-16",null,"25.144.267/0001-83","NOK","2018-08-03","OK","31.251.412/0001-28","47.41-5-00","Comércio varejista de tintas e materiais para pintura",null,1308,"OK",null,"",null,null,null,null,"NOK"]
["VOTORANTIM CIMENTOS S.A.","NF",229623,4947.6000000000004,null,"bar 180919","2019-08-28",null,"25.144.267/0001-83","NOK","2018-08-03","OK","01.637.895/0058-78","46.74-5-00 ","Comércio atacadista de cimento",null,4947.6000000000004,"OK",null,"",null,null,null,null,"NOK"]
["TUDO D'AGUA MATERIAIS PARA CONSTRUCAO LTDA.","NF",127889,2638.6,null,"bar 180919","2019-09-03",null,"25.144.267/0001-83",{"$f":"IF(I279=\"\",\"\",IF(OR(I279=H279,LEFT(H279,10)=LEFT(I279,10)),\"OK\",\"NOK\"))","v":"NOK"},"2018-08-03","OK","02.611.072/0001-09","47.44-0-99 ","Comércio varejista de materiais de construção em geral",null,2638.6,"OK",null,"",null,null,null,null,"NOK"]
["CONSTROESTE CONSTRUTORA E PARTICIPACOES LTDA","NF",55651,687.4,null,"bar 190919","2019-06-21",null,"25.144.267/0001-83","NOK","2018-08-03","OK","06.291.846/0004-57","42.99-5-99","Outras obras de engenharia civil não especificadas anteriormente",null,687.4,"OK",null,"",null,null,null,null,"NOK"]
["MORADA LAR E CONSTRUCAO LTDA","NF",3047,2916.66,null,"bar 230919","2019-09-16",null,"25.144.267/0001-83","NOK","2018-08-03","OK","27.488.256/0001-46","47.44-0-99","Comércio varejista de materiais de construção em geral",null,2916.66,"OK",null,"",null,null,null,null,"NOK"]
["UNISOL AQUECEDORES SOLARES LTDA","NF",43423,38659.629999999997,null,"bar 230919","2019-08-28",null,"25.144.267/0001-83","NOK","2018-08-03","OK","06.878.791/0001-33","27.59-7-99","Fabricação de outros aparelhos eletrodomésticos não especificados anteriormente, peças e acessórios",null,38659.629999999997,"OK",null,"","Aquecedores",null,null,null,"NOK"]
["CONSTROESTE CONSTRUTORA E PARTICIPACOES LTDA","NF",60421,947.24,null,"bar 230919","2019-08-23",null,"25.144.267/0001-83","NOK","2018-08-03","OK","06.291.846/0004-57","42.99-5-99","Outras obras de engenharia civil não especificadas anteriormente",null,947.24,"OK",null,"",null,null,null,null,"NOK"]
["CONSTROESTE CONSTRUTORA E PARTICIPACOES LTDA","NF",60431,491,null,"bar 230919","2019-08-23",null,"25.144.267/0001-83","NOK","2018-08-03","OK","06.291.846/0004-57","42.99-5-99","Outras obras de engenharia civil não especificadas anteriormente",null,491,{"$f":"IF(Q284=\"\",\"\",IF(Q284=D284,\"OK\",\"NOK\"))","v":"OK"},null,"",null,null,null,null,"NOK"]
["ANA PAULA EDUARTE - EIRELI","NF",191,1540,null,"bar 230919","2019-08-21",null,"25.144.267/0001-83","NOK",{"$f":"IF(A285=\"\",\"\",EDATE(TODAY(),-24))","v":"2018-08-03"},"OK","31.251.412/0001-28","47.41-5-00","Comércio varejista de tintas e materiais para pintura",null,1540,"OK",null,"",null,null,null,null,{"$f":"IF(A285=\"\",\"\",IF(V285=\"OK\",\"OK\",IF(AND(J285=\"OK\",L285=\"OK\",P285=\"OK\",R285=\"OK\"),\"OK\",\"NOK\")))","v":"NOK"}]
["VOTORANTIM CIMENTOS S.A.","NF",229938,924.8,null,"bar 270919","2019-08-30",null,"25.144.267/0001-83","NOK","2018-08-03","OK","01.637.895/0058-78","46.74-5-00 ","Comércio atacadista de cimento",null,924.8,"OK",null,"",null,null,null,null,"NOK"]
["TUDO D'AGUA MATERIAIS PARA CONSTRUCAO LTDA.","NF",128431,4643.93,null,"bar 270919","2019-09-12",null,"25.144.267/0001-83",{"$f":"IF(I287=\"\",\"\",IF(OR(I287=H287,LEFT(H287,10)=LEFT(I287,10)),\"OK\",\"NOK\"))","v":"NOK"},"2018-08-03","OK","02.611.072/0001-09","47.44-0-99 ","Comércio varejista de materiais de construção em geral",null,4643.93,"OK",null,"",null,null,null,null,"NOK"]
["WN ARGILAS E CERAMICAS LTDA","NF",294,1814.13,null,"bar 270919","2019-09-16",null,"25.144.267/0001-83","NOK","2018-08-03","OK","10.794.849/0001-38","23.42-7-02","Fabricação de artefatos de cerâmica e barro cozido para uso na construção, exceto azulejos e pisos",null,1814.13,"OK",null,"",null,null,null,null,"NOK"]
["CONSTROESTE CONSTRUTORA E PARTICIPACOES LTDA","NF",60791,1561.38,null,"bar 301019","2019-08-30",null,"25.144.267/0001-83","NOK","2018-08-03","OK","06.291.846/0004-57","42.99-5-99","Outras obras de engenharia civil não especificadas anteriormente",null,1561.38,"OK",null,"",null,null,null,null,"NOK"]
["TUDO D'AGUA MATERIAIS PARA CONSTRUCAO LTDA.","NF",127710,26778.69,null,"bar 301019","2019-08-29",null,"25.144.267/0001-83","NOK","2018-08-03","OK","02.611.072/0001-09","47.44-0-99 ","Comércio varejista de materiais de construção em geral",null,26778.69,"OK",null,"",null,null,null,null,"NOK"]
["ANA PAULA EDUARTE - EIRELI","NF",209,6750,null,"bar 301019","2019-09-12",null,"25.144.267/0001-83","NOK","2018-08-03","OK","31.251.412/0001-28","47.41-5-00","Comércio varejista de tintas e materiais para pintura",null,6750,"OK",null,"",null,null,null,null,"NOK"]
["ELIAS GARCIA DE SOUZA 85195057168","NF",57,1300,null,"bar 301019","2019-09-19",null,"25.144.267/0001-83","NOK","2018-08-03","OK","30.815.826/0001-70","43.30-4-04","Serviços de pintura de edifícios em geral",null,1300,"OK",null,"",null,null,null,null,"NOK"]
["COMERCIAL GOLDONI PRODUTOS SIDERURGICOS LTDA","NF",234026,15310.16,null,"bar 311019","2019-10-01",null,"25.144.267/0001-83","NOK","2018-08-03","OK","58.345.265/0001-01","47.44-0-99","Comércio varejista de materiais de construção em geral",null,15310.16,"OK",null,"",null,null,null,null,"NOK"]
["HAUS TINTAS E TEXTURAS LTDA","NF",41930,622.46,null,"bar 311019","2019-10-16",null,"25.144.267/0001-83","NOK","2018-08-03","OK","18.177.506/0001-36","46.79-6-01","Comércio atacadista de tintas, vernizes e similares",null,622.46,"OK",null,"",null,null,null,null,"NOK"]
["CLEITON JANOTA DE FREITAS 31142367827","NF",2831,7096.33,null,"bar 041019","2019-09-16",null,"25.144.267/0001-83","NOK","2018-08-03","OK","23.607.926/0001-45","43.99-1-04","Serviços de operação e fornecimento de equipamentos para transporte e elevação de cargas e pessoas para uso em obras",null,7096.33,"OK",null,"",null,null,null,null,"NOK"]
["ANA PAULA EDUARTE - EIRELI","NF",211,3460,null,"bar 071019","2019-09-20",null,"25.144.267/0001-83","NOK","2018-08-03","OK","31.251.412/0001-28","47.41-5-00","Comércio varejista de tintas e materiais para pintura",null,3460,"OK",null,"",null,null,null,null,"NOK"]
["AGROMETAL COMERCIAL DE FERRAGENS LTDA","NF",92876,1482.5,null,"bar 071019","2019-08-02",null,"25.144.267/0001-83","NOK","2018-08-03","OK","48.539.548/0007-26","47.44-0-99","Comércio varejista de materiais de construção em geral",null,1482.5,"OK",null,"",null,null,null,null,"NOK"]
["AGROMETAL COMERCIAL DE FERRAGENS LTDA","NF",92997,1542.5,null,"bar 071019","2019-08-03",null,"25.144.267/0001-83","NOK","2018-08-03","OK","48.539.548/0007-26","47.44-0-99","Comércio varejista de materiais de construção em geral",null,1542.5,"OK",null,"",null,null,null,null,"NOK"]
["VOTORANTIM CIMENTOS S.A.","NF",231212,4947.6000000000004,null,"bar 071019","2019-09-16",null,"25.144.267/0001-83","NOK","2018-08-03","OK","01.637.895/0058-78","46.74-5-00 ","Comércio atacadista de cimento",null,4947.6000000000004,"OK",null,"",null,null,null,null,"NOK"]
["CONSTROESTE CONSTRUTORA E PARTICIPACOES LTDA","NF",59471,1040.92,null,"bar 071019","2019-08-09",null,"25.144.267/0001-83","NOK","2018-08-03","OK","06.291.846/0004-57","42.99-5-99","Outras obras de engenharia civil não especificadas anteriormente",null,1040.92,"OK",null,"",null,null,null,null,"NOK"]
["FRIGO & CARDOSO EXTINTORES LTDA","NF",4162,18681,null,"bar 081019","2019-09-23",null,"25.144.267/0001-83","NOK","2018-08-03","OK","18.625.636/0001-94","47.89-0-9","Comércio varejista de outros produtos não especificados anteriormente",null,18681,"OK",null,"","Caixa de luz, extintor, chumbador",null,null,null,"NOK"]
["J. C. M. NITEROI REFRIGERACAO LTDA","NF",34752,9958.5400000000009,null,"bar 091019","2019-09-11",null,"25.144.267/0001-83","NOK","2018-08-03","OK","08.824.171/0008-13","47.44-0-99"," Comércio varejista de materiais de construção em geral",null,9958.5400000000009,"OK",null,"",null,null,null,null,"NOK"]
["WN ARGILAS E CERAMICAS LTDA","NF",300,2010.13,null,"bar 091019","2019-09-24",null,"25.144.267/0001-83","NOK","2018-08-03","OK","10.794.849/0001-38","23.42-7-02","Fabricação de artefatos de cerâmica e barro cozido para uso na construção, exceto azulejos e pisos",null,2010.13,"OK",null,"",null,null,null,null,"NOK"]
["GOL BARRETOS CONSTRUCOES - EIRELI","NF",401,2587.1999999999998,null,"bar 141019","2019-10-02",null,"25.144.267/0001-83","NOK","2018-08-03","OK","33.930.372/0001-76","38.11-4-00","Coleta de resíduos não-perigosos",null,2587.1999999999998,"OK",null,"",null,null,null,null,"NOK"]
["CONSTROESTE CONSTRUTORA E PARTICIPACOES LTDA","NF",61701,910.8,null,"bar 141019","2019-09-13",null,"25.144.267/0001-83","NOK","2018-08-03","OK","06.291.846/0004-57","42.99-5-99","Outras obras de engenharia civil não especificadas anteriormente",null,910.8,"OK",null,"",null,null,null,null,"NOK"]
["FRIGO & CARDOSO EXTINTORES LTDA","NF",12864,1600,null,"bar 151019","2019-10-01",null,"25.144.267/0001-83","NOK","2018-08-03",{"$f":"IF(G306=\"\",\"\",IF(G306>=K306,\"OK\",\"NOK\"))","v":"OK"},"18.625.636/0001-94","47.89-0-9","Comércio varejista de outros produtos não especificados anteriormente",null,1600,"OK",null,"",null,null,null,null,"NOK"]
["R. L. P. MILANES","NF",2175,22500,null,"bar 151019","2019-09-18",null,"25.144.267/0001-83","NOK","2018-08-03","OK","15.136.730/0001-91","47.42-3-00","Comércio varejista de material elétrico",null,22500,"OK",null,"",null,null,null,null,"NOK"]
["TUDO D'AGUA MATERIAIS PARA CONSTRUCAO LTDA.","NF",126687,1174.8499999999999,null,"bar 151019","2019-08-10",null,"25.144.267/0001-83",{"$f":"IF(I308=\"\",\"\",IF(OR(I308=H308,LEFT(H308,10)=LEFT(I308,10)),\"OK\",\"NOK\"))","v":"NOK"},"2018-08-03","OK","02.611.072/0001-09","47.44-0-99 ","Comércio varejista de materiais de construção em geral",null,1174.8499999999999,"OK",null,"",null,null,null,null,"NOK"]
["FERRARE ASSESSORIA LTDA","NF",163,11000,null,"bar 151019","2019-10-01",null,"25.144.267/0001-83","NOK","2018-08-03","OK","16.688.405/0001-02","43.11-8-01","Demolição de edifícios e outras estruturas",null,11000,"OK",null,"",null,null,null,null,"NOK"]
["CONSTROESTE CONSTRUTORA E PARTICIPACOES LTDA","NF",60271,17050.27,null,"bar 211019","2019-08-21",null,"25.144.267/0001-83","NOK","2018-08-03","OK","06.291.846/0004-57","42.99-5-99","Outras obras de engenharia civil não especificadas anteriormente",null,17050.27,"OK",null,"",null,null,null,null,"NOK"]
["CONSTROESTE CONSTRUTORA E PARTICIPACOES LTDA","NF",60281,1546.65,null,"bar 211019","2019-08-21",null,"25.144.267/0001-83","NOK","2018-08-03","OK","06.291.846/0004-57","42.99-5-99","Outras obras de engenharia civil não especificadas anteriormente",null,1546.65,"OK",null,"",null,null,null,null,"NOK"]
["CONSTROESTE CONSTRUTORA E PARTICIPACOES LTDA","NF",62131,16324.73,null,"bar 211019","2019-09-19",null,"25.144.267/0001-83","NOK","2018-08-03","OK","06.291.846/0004-57","42.99-5-99","Outras obras de engenharia civil não especificadas anteriormente",null,16324.73,"OK",null,"",null,null,null,null,"NOK"]
["R. P. INDUSTRIA E COMERCIO DE ARTEFATOS DE CIMENTO LTDA","NF",844,16855.82,null,"bar 211019","2019-07-23",null,"25.144.267/0001-83","NOK","2018-08-03","OK","14.264.380/0001-86","23.30-3-02"," Fabricação de artefatos de cimento para uso na construção",null,16855.82,"OK",null,"",null,null,null,null,"NOK"]
["TUDO D'AGUA MATERIAIS PARA CONSTRUCAO LTDA.","NF",129438,8894,null,"bar 211019","2019-10-04",null,"25.144.267/0001-83","NOK","2018-08-03","OK","02.611.072/0001-09","47.44-0-99 ","Comércio varejista de materiais de construção em geral",null,8894,"OK",null,"",null,null,null,null,"NOK"]
["TUDO D'AGUA MATERIAIS PARA CONSTRUCAO LTDA.","NF",129439,10080,null,"bar 211019","2019-10-04",null,"25.144.267/0001-83","NOK","2018-08-03","OK","02.611.072/0001-09","47.44-0-99 ","Comércio varejista de materiais de construção em geral",null,10080,"OK",null,"",null,null,null,null,"NOK"]
["VOTORANTIM CIMENTOS S.A.","NF",232515,4947.6000000000004,null,"bar 211019","2019-10-01",null,"25.144.267/0001-83","NOK","2018-08-03","OK","01.637.895/0058-78","46.74-5-00 ","Comércio atacadista de cimento",null,4947.6000000000004,"OK",null,"",null,null,null,null,"NOK"]
["CONDUMAX - ELETRO METALURGICA CIAFUNDI LTDA","NF",224255,25366.04,null,"bar 291019","2019-10-02",null,"25.144.267/0001-83","NOK","2018-08-03","OK","53.224.127/0005-84","27.33-3-00","Fabricação de fios, cabos e condutores elétricos isolados",null,25366.04,"OK",null,"",null,null,null,null,"NOK"]
["CALIXTO SERVICOS EM GESSO EIRELI","NF",5,33682.94,null,"bar 011119","2019-10-11",null,"25.144.267/0001-83","NOK","2018-08-03","OK","34.783.442/0001-73","43.30-4-03"," Obras de acabamento em gesso e estuque",null,33682.94,"OK",null,"",null,null,null,null,"NOK"]
["FRIGO & CARDOSO EXTINTORES LTDA","NF",12957,10000,null,"bar 011119","2019-10-11",null,"25.144.267/0001-83","NOK","2018-08-03","OK","18.625.636/0001-94","47.89-0-9","Comércio varejista de outros produtos não especificados anteriormente",null,10000,"OK",null,"",null,null,null,null,"NOK"]
["MORADA LAR E CONSTRUCAO LTDA","NF",3209,2916.66,null,"bar 041119","2019-10-17",null,"25.144.267/0001-83","NOK","2018-08-03","OK","27.488.256/0001-46","47.44-0-99","Comércio varejista de materiais de construção em geral",null,2916.66,"OK",null,"",null,null,null,null,"NOK"]
["ACOS GOLDONI LTDA","NF",98963,17809.41,null,"bar 041119","2019-10-02",null,"25.144.267/0001-83","NOK","2018-08-03","OK","57.958.175/0001-23","25.99-3-99 ","Fabricação de outros produtos de metal não especificados anteriormente",null,17809.41,"OK",null,"",null,null,null,null,"NOK"]
["VOTORANTIM CIMENTOS S.A.","NF",233607,4947.6000000000004,null,"bar 051119","2019-10-15",null,"25.144.267/0001-83","NOK","2018-08-03","OK","01.637.895/0058-78","46.74-5-00 ","Comércio atacadista de cimento",null,4947.6000000000004,"OK",null,"",null,null,null,null,"NOK"]
["CLEITON JANOTA DE FREITAS 31142367827","NF",2981,1749.78,null,"bar 111119","2019-10-28",null,"25.144.267/0001-83","NOK","2018-08-03","OK","23.607.926/0001-45","43.99-1-04","Serviços de operação e fornecimento de equipamentos para transporte e elevação de cargas e pessoas para uso em obras",null,1749.78,"OK",null,"",null,null,null,null,"NOK"]
["VOTORANTIM CIMENTOS S.A.","NF",234260,4947.6000000000004,null,"bar 131119","2019-10-23",null,"25.144.267/0001-83","NOK","2018-08-03","OK","01.637.895/0058-78","46.74-5-00 ","Comércio atacadista de cimento",null,4947.6000000000004,"OK",null,"",null,null,null,null,"NOK"]
["R. P. INDUSTRIA E COMERCIO DE ARTEFATOS DE CIMENTO LTDA","NF",892,9864.1,null,"bar 181119","2019-10-16",null,"25.144.267/0001-83","NOK","2018-08-03","OK","14.264.380/0001-86","23.30-3-02"," Fabricação de artefatos de cimento para uso na construção",null,9864.1,"OK",null,"",null,null,null,null,"NOK"]
["FERREIRA & FERNANDES DOS SANTOS LTDA","NF",4925,1354.9,null,"bar 191119","2019-10-22",null,"25.144.267/0001-83","NOK","2018-08-03","OK","07.438.381/0001-34","47.44-0-99","Comércio varejista de materiais de construção em geral",null,1354.9,"OK",null,"",null,null,null,null,"NOK"]
["CONSTROESTE CONSTRUTORA E PARTICIPACOES LTDA","NF",62321,736.5,null,"bar 251119","2019-09-25",null,"25.144.267/0001-83","NOK","2018-08-03","OK","06.291.846/0004-57","42.99-5-99","Outras obras de engenharia civil não especificadas anteriormente",null,736.5,"OK",null,"",null,null,null,null,"NOK"]
["CONSTROESTE CONSTRUTORA E PARTICIPACOES LTDA","NF",62311,8335.61,null,"bar 251119","2019-09-25",null,"25.144.267/0001-83","NOK","2018-08-03","OK","06.291.846/0004-57","42.99-5-99","Outras obras de engenharia civil não especificadas anteriormente",null,8335.61,"OK",null,"",null,null,null,null,"NOK"]
["CONSTROESTE CONSTRUTORA E PARTICIPACOES LTDA","NF",64321,260.23,null,"bar 251119","2019-10-24",null,"25.144.267/0001-83","NOK","2018-08-03","OK","06.291.846/0004-57","42.99-5-99","Outras obras de engenharia civil não especificadas anteriormente",null,260.23,"OK",null,"",null,null,null,null,"NOK"]
["ANA PAULA EDUARTE - EIRELI","NF",261,1860.4,null,"bar 251119","2019-11-18",null,"25.144.267/0001-83","NOK","2018-08-03","OK","31.251.412/0001-28","47.41-5-00","Comércio varejista de tintas e materiais para pintura",null,1860.4,"OK",null,"",null,null,null,null,"NOK"]
["ANA PAULA EDUARTE - EIRELI","NF",275,1750,null,"bar 261119","2019-11-21",null,"25.144.267/0001-83","NOK","2018-08-03","OK","31.251.412/0001-28","47.41-5-00","Comércio varejista de tintas e materiais para pintura",null,1750,"OK",null,"",null,null,null,null,"NOK"]
["CONSTROESTE CONSTRUTORA E PARTICIPACOES LTDA","NF",62621,1623.84,null,"bar 261119","2019-09-27",null,"25.144.267/0001-83","NOK","2018-08-03","OK","06.291.846/0004-57","42.99-5-99","Outras obras de engenharia civil não especificadas anteriormente",null,1623.84,"OK",null,"",null,null,null,null,"NOK"]
["CONSTROESTE CONSTRUTORA E PARTICIPACOES LTDA","NF",62631,491,null,"bar 261119","2019-09-27",null,"25.144.267/0001-83","NOK","2018-08-03","OK","06.291.846/0004-57","42.99-5-99","Outras obras de engenharia civil não especificadas anteriormente",null,491,"OK",null,"",null,null,null,null,"NOK"]
["CONSTROESTE CONSTRUTORA E PARTICIPACOES LTDA","NF",64441,485,null,"bar 271119","2019-10-28",null,"25.144.267/0001-83","NOK","2018-08-03","OK","06.291.846/0004-57","42.99-5-99","Outras obras de engenharia civil não especificadas anteriormente",null,485,"OK",null,{"$f":"IF(S334=\"\",\"\",IF(S334=E334,\"OK\",\"NOK\"))","v":""},null,null,null,null,"NOK"]
["CONSTROESTE CONSTRUTORA E PARTICIPACOES LTDA","NF",64451,4059.59,null,"bar 271119","2019-10-28",null,"25.144.267/0001-83","NOK","2018-08-03","OK","06.291.846/0004-57","42.99-5-99","Outras obras de engenharia civil não especificadas anteriormente",null,4059.59,"OK",null,"",null,null,null,null,"NOK"]
["AGROMETAL COMERCIAL DE FERRAGENS LTDA","NF",103011,3600,null,"bar 271119","2019-11-11",null,"25.144.267/0001-83","NOK","2018-08-03","OK","48.539.548/0007-26","47.44-0-99","Comércio varejista de materiais de construção em geral",null,3600,"OK",null,"",null,null,null,null,"NOK"]
["VOTORANTIM CIMENTOS S.A.","NF",235593,4947.6000000000004,null,"bar 281119","2019-11-07",null,"25.144.267/0001-83","NOK","2018-08-03","OK","01.637.895/0058-78","46.74-5-00 ","Comércio atacadista de cimento",null,4947.6000000000004,"OK",null,"",null,null,null,null,"NOK"]
["TUDO D'AGUA MATERIAIS PARA CONSTRUCAO LTDA.","NF",131454,5900,null,"bar 281119","2019-11-13",null,"25.144.267/0001-83","NOK","2018-08-03","OK","02.611.072/0001-09","47.44-0-99 ","Comércio varejista de materiais de construção em geral",null,5900,"OK",null,"",null,null,null,null,"NOK"]
["SERRALHERIA JB LTDA","NF",1432,20000,null,"bar 291119","2019-11-19",null,"25.144.267/0001-83","NOK","2018-08-03","OK","44.404.697/0001-31","25.12-8-00"," Fabricação de esquadrias de metal",null,20000,"OK",null,"",null,null,null,null,"NOK"]
["CALIXTO SERVICOS EM GESSO EIRELI","NF",14,2400,null,"bar 291119","2019-11-18",null,"25.144.267/0001-83","NOK","2018-08-03","OK","34.783.442/0001-73","43.30-4-03"," Obras de acabamento em gesso e estuque",null,2400,"OK",null,"",null,null,null,null,"NOK"]
["CALIXTO SERVICOS EM GESSO EIRELI","NF",12,67365.88,null,"bar 291119","2019-11-18",null,"25.144.267/0001-83","NOK","2018-08-03","OK","34.783.442/0001-73","43.30-4-03"," Obras de acabamento em gesso e estuque",null,67365.88,"OK",null,"",null,null,null,null,"NOK"]
["CALIXTO SERVICOS EM GESSO EIRELI","NF",19,40418.22,null,"2020-FEV.07-02","2020-01-27",null,"25.144.267/0001-83","NOK",{"$f":"IF(A342=\"\",\"\",EDATE(TODAY(),-24))","v":"2018-08-03"},"OK","34.783.442/0001-73","43.30-4-03","Obras de acabamento em gesso e estuque",null,40418.22,{"$f":"IF(Q342=\"\",\"\",IF(Q342=D342,\"OK\",\"NOK\"))","v":"OK"},null,"",null,null,null,null,{"$f":"IF(A342=\"\",\"\",IF(V342=\"OK\",\"OK\",IF(AND(J342=\"OK\",L342=\"OK\",P342=\"OK\",R342=\"OK\"),\"OK\",\"NOK\")))","v":"NOK"}]
["CASA DO EPI COMERCIO VAREJISTA BARRETOS LTDA","NF","00000.3841",180,null,"2020-FEV.07-02","2020-01-23",null,"25.144.267/0001-83","NOK","2018-08-03","OK","12.565.738/0001-85","43.22-3-03","Instalações de sistema de prevenção contra incêndio",null,180,"OK",null,"",null,null,null,null,"NOK"]
["LOJAS CEM S.A","NF",13742696,6124.35,null,"2020-FEV.07-02","2019-11-08",null,"25.144.267/0001-83","NOK","2018-08-03","OK","56.642.960/0001-00","47.54-7-01","Comércio varejista de móveis",null,6124.35,"OK",null,"",null,null,null,null,"NOK"]
["LEDZS ILUMINACAO LTDA","NF",400,22808.29,null,"2020-FEV.10-02","2019-11-22",null,"25.144.267/0001-83","NOK","2018-08-03","OK","11.037.885/0001-10","47.42-3-00","Comércio varejista de material elétrico",null,22808.29,"OK",null,"",null,null,null,null,"NOK"]
["VOTORANTIM CIMENTOS S.A.","NF",240604,4930,null,"2020-FEV.10-02","2020-01-20",null,"25.144.267/0001-83","NOK","2018-08-03","OK","01.637.895/0058-78","46.74-5-00","Comércio atacadista de cimento",null,4930,"OK",null,"",null,null,null,null,"NOK"]
["SERRALHERIA JB LTDA","NF",1442,1980,null,"2020-FEV.10-02","2020-01-13",null,"25.144.267/0001-83","NOK","2018-08-03","OK","44.404.697/0001-31","25.12-8-00","Comércio varejista de materiais de construção em geral",null,1980,"OK",null,"",null,null,null,null,"NOK"]
["FERRARE ASSESSORIA LTDA","NF",181,11000,null,"2020-FEV.10-02","2020-02-05",null,"25.144.267/0001-83","NOK","2018-08-03","OK","16.688.405/0001-02","43.11-8-01","Demolição de edifícios e outras estruturas",null,11000,"OK",null,"",null,null,null,null,"NOK"]
["TUDO D'AGUA MATERIAIS PARA CONSTRUCAO LTDA.","NF",133110,1536.37,null,"2020-FEV.12-02","2019-12-14",null,"25.144.267/0001-83","NOK","2018-08-03","OK","02.611.072/0001-09","47.44-0-99","Comércio varejista de materiais de construção em geral",null,1536.37,"OK",null,"",null,null,null,null,"NOK"]
["TUDO D'AGUA MATERIAIS PARA CONSTRUCAO LTDA.","NF",135062,10755.83,null,"2020-FEV.12-02","2020-01-28",null,"25.144.267/0001-83","NOK","2018-08-03","OK","02.611.072/0001-09","47.44-0-99","Comércio varejista de materiais de construção em geral",null,10755.83,"OK",null,"",null,null,null,null,"NOK"]
["TUDO D'AGUA MATERIAIS PARA CONSTRUCAO LTDA.","NF",135074,9887.41,null,"2020-FEV.13-02","2020-01-29",null,"25.144.267/0001-83","NOK","2018-08-03","OK","02.611.072/0001-09","47.44-0-99","Comércio varejista de materiais de construção em geral",null,9887.41,"OK",null,"",null,null,null,null,"NOK"]
["CONSTRULOG BARRETOS LTDA","NF",1901,907,null,"2020-FEV.14-02","2020-01-14",null,"25.144.267/0001-83","NOK","2018-08-03","OK","20.523.240/0001-88","47.44-0-01","Comércio varejista de ferragens e ferramentas",null,907,"OK",null,"",null,null,null,null,"NOK"]
["CONSTRULOG BARRETOS LTDA","NF",1861,80,null,"2020-FEV.14-02","2020-01-14",null,"25.144.267/0001-83","NOK","2018-08-03","OK","20.523.240/0001-88","47.44-0-01","Comércio varejista de ferragens e ferramentas",null,80,"OK",null,"",null,null,null,null,"NOK"]
["EXPANDIR CONSTRUTORA","NF",161,10000,null,"2020-FEV.14-02","2020-01-31",null,"25.144.267/0001-83","NOK","2018-08-03","OK","33.803.059/0001-77","43.99-1-03","Obras de alvenaria",null,10000,"OK",null,"",null,null,null,null,"NOK"]
["TUDO D'AGUA MATERIAIS PARA CONSTRUCAO LTDA.","NF",129879,20340.599999999999,null,"2020-FEV.17-02","2019-10-11",null,"25.144.267/0001-83","NOK","2018-08-03","OK","02.611.072/0001-09","47.44-0-99","Comércio varejista de materiais de construção em geral",null,20340.599999999999,"OK",null,"",null,null,null,null,"NOK"]
["GUAIRA COMERCIO DE TINTAS LTDA","NF",2766,973.94,null,"2020-FEV.17-02","2019-11-18",null,"25.144.267/0001-83","NOK","2018-08-03","OK","72.697.501/0003-41","47.41-5-00","Comércio varejista de tintas e materiais para pintura",null,973.94,"OK",null,"",null,null,null,null,"NOK"]
["IMPERMAXX IMPERMEABILIZACAO - EIRELI","NF",228,30000.2,null,"2020-FEV.17-02","2020-01-16",null,"25.144.267/0001-83","NOK","2018-08-03","OK","18.249.625/0001-57","41.20-4-00","Construção de edifícios",null,30000.2,"OK",null,"",null,null,null,null,"NOK"]
["GUAIRA COMERCIO DE TINTAS LTDA","NF",3006,4975.5600000000004,null,"2020-FEV.17-02","2019-12-19",null,"25.144.267/0001-83","NOK","2018-08-03","OK","72.697.501/0003-41","47.41-5-00","Comércio varejista de tintas e materiais para pintura",null,4975.5600000000004,"OK",null,"",null,null,null,null,"NOK"]
["GUAIRA COMERCIO DE TINTAS LTDA","NF",3004,1488,null,"2020-FEV.17-02","2019-12-19",null,"25.144.267/0001-83","NOK","2018-08-03","OK","72.697.501/0003-41","47.41-5-00","Comércio varejista de tintas e materiais para pintura",null,1488,"OK",null,"",null,null,null,null,"NOK"]
["FERREIRA AYUB COMERCIO DE MATERIAIS ELETRICOS LTDA","NF",8625,603.5,null,"2020-FEV.17-02","2020-01-20",null,"25.144.267/0001-83","NOK","2018-08-03","OK","14.159.886/0001-25","47.42-3-00","Comércio varejista de material elétrico",null,603.5,"OK",null,"",null,null,null,null,"NOK"]
["GOL BARRETOS CONSTRUCOES - EIRELI","NF",681,1980,null,"2020-FEV.17-02","2020-01-15",null,"25.144.267/0001-83",{"$f":"IF(I361=\"\",\"\",IF(OR(I361=H361,LEFT(H361,10)=LEFT(I361,10)),\"OK\",\"NOK\"))","v":"NOK"},"2018-08-03",{"$f":"IF(G361=\"\",\"\",IF(G361>=K361,\"OK\",\"NOK\"))","v":"OK"},"33.930.372/0001-76","38.11-4-00","Coleta de resíduos não perigosos",null,1980,"OK",null,"",null,null,null,null,"NOK"]
["DURATEX S.A.","NF",1190817,3319.33,null,"2020-FEV.18-02","2020-01-21",null,"25.144.267/0001-83","NOK","2018-08-03","OK","97.837.181/0022-71","23.49-4-01","Fabricação de material sanitário de cerâmica",null,3319.33,"OK",null,"",null,null,null,null,"NOK"]
["DURATEX S.A.","NF",2731714,32452.71,null,"2020-FEV.18-02","2020-01-21",null,"25.144.267/0001-83","NOK","2018-08-03","OK","97.837.181/0022-71","23.49-4-01","Fabricação de material sanitário de cerâmica",null,32452.71,"OK",null,"",null,null,null,null,"NOK"]
["TUDO D'AGUA MATERIAIS PARA CONSTRUCAO LTDA.","NF",1193764,2012.59,null,"2020-FEV.19-02","2020-02-04",null,"25.144.267/0001-83","NOK","2018-08-03","OK","02.611.072/0001-09","47.44-0-99","Comércio varejista de materiais de construção em geral",null,2012.59,"OK",null,"",null,null,null,null,"NOK"]
["ENFIX COMERCIAL LTDA","NF",17841,10300,null,"2020-FEV.20-02","2019-11-07",null,"25.144.267/0001-83","NOK","2018-08-03","OK","01.046.778/0001-02","47.44-0-01","Comércio varejista de ferragens e ferramentas",null,10300,"OK",null,"",null,null,null,null,"NOK"]
["TUDO D'AGUA MATERIAIS PARA CONSTRUCAO LTDA.","NF",135388,1520,null,"2020-FEV.20-02","2020-02-05",null,"25.144.267/0001-83","NOK","2018-08-03","OK","02.611.072/0001-09","47.44-0-99","Comércio varejista de materiais de construção em geral",null,1520,"OK",null,"",null,null,null,null,"NOK"]
["LOJAS CEM S.A","NF",14487922,1880,null,"2020-FEV.20-02","2020-01-19",null,"25.144.267/0001-83","NOK","2018-08-03","OK","56.642.960/0001-00","47.54-7-01","Comércio varejista de móveis",null,1880,"OK",null,"",null,null,null,null,"NOK"]
["GUAIRA COMERCIO DE TINTAS LTDA","NF",3243,3906,null,"2020-FEV.26-02","2020-01-24",null,"25.144.267/0001-83","NOK","2018-08-03","OK","72.697.501/0003-41","47.41-5-00","Comércio varejista de tintas e materiais para pintura",null,3906,"OK",null,"",null,null,null,null,"NOK"]
["AC MATERIAIS ELETRICOS LTDA","NF",16762,3322.45,null,"2020-FEV.26-02","2020-01-27",null,"25.144.267/0001-83","NOK","2018-08-03","OK","16.646.634/0001-56","47.42-3-00","Comércio varejista de material elétrico",null,3322.45,"OK",null,"",null,null,null,null,"NOK"]
["BUSCARIOLI COMERCIO E OFICINA DE MOTORES ELETRICOS LTDA.","NF","000.099.373",4908,null,"2020-FEV.26-02","2020-01-23",null,"25.144.267/0001-83","NOK","2018-08-03","OK","09.193.580/0001-55","33.13-9-01","Manutenção e reparação de geradores, transformadores e motores elétricos",null,4908,"OK",null,"",null,null,null,null,"NOK"]
["NEOTERMICA ISOLANTES TERMICOS E REVESTIMENTOS METALICOS LTDA.","NF",70848,3218.61,null,"2020-FEV.26-02","2020-01-27",null,"25.144.267/0001-83","NOK","2018-08-03","OK","51.760.270/0001-31","46.89-3-99","Comércio atacadista especializado em outros produtos intermediários não especificados anteriormente",null,3218.61,"OK",null,"",null,null,null,null,"NOK"]
["DURATEX S.A.","NF",1193764,11178,null,"2020-FEV.26-02","2020-01-27",null,"25.144.267/0001-83","NOK","2018-08-03","OK","97.837.181/0022-71","23.49-4-01","Fabricação de material sanitário de cerâmica",null,11178,"OK",null,"",null,null,null,null,"NOK"]
["RENTSERVICE LOCACAO DE EQUIPAMENTOS LTDA","NF",7265,5965,null,"2020-FEV.26-02","2020-01-28",null,"25.144.267/0001-83","NOK","2018-08-03","OK","32.397.210/0001-51","33.14-7-99","Manutenção e reparação de outras máquinas e equipamentos para usos industriais não especificados anteriormente",null,5965,"OK",null,"",null,null,null,null,"NOK"]
["TUDO D'AGUA MATERIAIS PARA CONSTRUCAO LTDA.","NF",135378,455.55,null,"2020-FEV.26-02","2020-02-04",null,"25.144.267/0001-83","NOK","2018-08-03","OK","02.611.072/0001-09","47.44-0-99","Comércio varejista de materiais de construção em geral",null,455.55,"OK",null,"",null,null,null,null,"NOK"]
["4M SAS DISTRIBUIDORA EIRELI","NF",5128,47216.76,null,"2020-FEV.26-02","2020-02-10",null,"25.144.267/0001-83","NOK","2018-08-03","OK","16.660.632/0001-23","46.49-4-01","Comércio atacadista de equipamentos elétricos de uso pessoal e doméstico",null,47216.76,"OK",null,"",null,null,null,null,"NOK"]
["COMAP MATERIAIS PARA CONSTRUCOES LTDA","NF",49194,2120.9,null,"2020-FEV.28-02","2020-02-07",null,"25.144.267/0001-83","NOK","2018-08-03","OK","48.447.627/0001-11","47.44-0-05","Comércio varejista de materiais de construção não especificados anteriormente",null,2120.9,"OK",null,"",null,null,null,null,"NOK"]
["FRIGELAR COMERCIO E INDUSTRIA LTDA","NF",416892,2310.63,null,"2020-FEV.28-02","2019-12-02",null,"25.144.267/0001-83","NOK","2018-08-03","OK","92.660.406/0020-81","47.57-1-00","Comércio varejista especializado de peças e acessórios para aparelhos eletroeletrônicos para uso doméstico, exceto informática e comunicação",null,2310.63,"OK",null,"",null,null,null,null,"NOK"]
["J. BELOTI GRANITOS E MARMORES EIRELI","NF",183,18000,null,"2020-FEV.28-02","2020-01-16",null,"25.144.267/0001-83","NOK","2018-08-03","OK","32.082.616/0001-45","46.79-6-02","Comércio atacadista de mármores e granitos",null,18000,"OK",null,"",null,null,null,null,"NOK"]
["AGROMETAL COMERCIAL DE FERRAGENS LTDA","NF",109129,582,null,"2020-FEV.28-02","2020-01-16",null,"25.144.267/0001-83","NOK","2018-08-03","OK","48.539.548/0007-26","47.44-0-99","Comércio varejista de materiais de construção em geral",null,582,"OK",null,"",null,null,null,null,"NOK"]
["AGROMETAL COMERCIAL DE FERRAGENS LTDA","NF",109141,2255.25,null,"2020-FEV.28-02","2020-03-01",null,"25.144.267/0001-83","NOK","2018-08-03","OK","48.539.548/0007-26","47.44-0-99","Comércio varejista de materiais de construção em geral",null,2255.25,"OK",null,"",null,null,null,null,"NOK"]
["CONSTRULOG BARRETOS LTDA","NF",1898,1720,null,"2020-FEV.28-02","2020-02-28",null,"25.144.267/0001-83","NOK","2018-08-03","OK","20.523.240/0001-88","47.44-0-01","Comércio varejista de ferragens e ferramentas",null,1720,"OK",null,"",null,null,null,null,"NOK"]
["EXPANDIR CONSTRUTORA","NF",171,8500,null,"2020-FEV.28-02","2020-02-10",null,"25.144.267/0001-83","NOK","2018-08-03","OK","33.803.059/0001-77","43.99-1-03","Obras de alvenaria",null,8500,"OK",null,"",null,null,null,null,"NOK"]
["INDUSTRIA E COMERCIO DE TINTAS ROMA LTDA","NF",16370,5414,null,"2020-FEV.28-02","2020-02-14",null,"25.144.267/0001-83","NOK","2018-08-03","OK","72.866.528/0001-59","20.71-1-00","Fabricação de tintas, vernizes, esmaltes e lacas",null,5414,"OK",null,"",null,null,null,null,"NOK"]
["TUDO D'AGUA MATERIAIS PARA CONSTRUCAO LTDA.","NF",135900,2476.11,null,"2020-FEV.28-02","2020-02-13",null,"25.144.267/0001-83","NOK","2018-08-03","OK","02.611.072/0001-09","47.44-0-99 ","Comércio varejista de materiais de construção em geral",null,2476.11,"OK",null,"",null,null,null,null,"NOK"]
["MORADA LAR E CONSTRUCAO LTDA","NF",3456,2916.66,null,"bar 010120","2019-12-10",null,"25.144.267/0001-83","NOK","2018-08-03","OK","27.488.256/0001-46","47.44-0-99","Comércio varejista de materiais de construção em geral",null,2916.66,"OK",null,"",null,null,null,null,"NOK"]
["CONSTROESTE CONSTRUTORA E PARTICIPACOES LTDA","NF",63291,650.57000000000005,null,"bar 060120","2019-10-08",null,"25.144.267/0001-83","NOK","2018-08-03","OK","06.291.846/0004-57","42.99-5-99","Comércio varejista de materiais de construção em geral",null,650.57000000000005,"OK",null,{"$f":"IF(S386=\"\",\"\",IF(S386=E386,\"OK\",\"NOK\"))","v":""},null,null,null,null,"NOK"]
["CONSTROESTE CONSTRUTORA E PARTICIPACOES LTDA","NF",63191,520.46,null,"bar 060120","2019-10-07",null,"25.144.267/0001-83","NOK","2018-08-03","OK","06.291.846/0004-57","42.99-5-99","Comércio varejista de materiais de construção em geral",null,520.46,"OK",null,"",null,null,null,null,"NOK"]
["VITRAL VIDROS PLANOS LTDA","NF",499936,1167.8,null,"bar 060120","2019-11-06",null,"25.144.267/0001-83","NOK","2018-08-03","OK","71.821.169/0001-50","46.79-6-04","Comércio varejista de materiais de construção em geral",null,1167.8,"OK",null,"",null,null,null,null,"NOK"]
["TUDO D'AGUA MATERIAIS PARA CONSTRUCAO LTDA.","NF",131206,1508.97,null,"bar 060120","2019-11-11",null,"25.144.267/0001-83","NOK","2018-08-03","OK","02.611.072/0001-09","47.44-0-99 ","Comércio varejista de materiais de construção em geral",null,1508.97,"OK",null,"",null,null,null,null,"NOK"]
["CONSTROESTE CONSTRUTORA E PARTICIPACOES LTDA","NF",65131,780.69,null,"bar 060120","2019-11-06",null,"25.144.267/0001-83","NOK","2018-08-03","OK","06.291.846/0004-57","42.99-5-99","Comércio varejista de materiais de construção em geral",null,780.69,"OK",null,"",null,null,null,null,"NOK"]
["GOL BARRETOS CONSTRUCOES - EIRELI","NF",641,6252.4,null,"bar 080120","2019-12-24",null,"25.144.267/0001-83","NOK","2018-08-03","OK","33.930.372/0001-76","38.11-4-00","Comércio varejista de materiais de construção em geral",null,6252.4,"OK",null,"",null,null,null,null,"NOK"]
["FERREIRA AYUB COMERCIO DE MATERIAIS ELETRICOS LTDA","NF",8513,2400,null,"bar 100120","2019-12-20",null,"25.144.267/0001-83","NOK","2018-08-03","OK","14.159.886/0001-25","47.42-3-00","Comércio varejista de material elétrico",null,2400,"OK",null,"",null,null,null,null,"NOK"]
["FERREIRA AYUB COMERCIO DE MATERIAIS ELETRICOS LTDA","NF",8512,3922.8,null,"bar 100120","2019-12-20",null,"25.144.267/0001-83","NOK","2018-08-03","OK","14.159.886/0001-25","47.42-3-00","Comércio varejista de material elétrico",null,3922.8,"OK",null,"",null,null,null,null,"NOK"]
["HAUS TINTAS E TEXTURAS LTDA","NF",46645,622.46,null,"bar 130120","2019-11-27",null,"25.144.267/0001-83","NOK","2018-08-03","OK","18.177.506/0001-36","46.79-6-01","Comércio varejista de materiais de construção em geral",null,622.46,{"$f":"IF(Q394=\"\",\"\",IF(Q394=D394,\"OK\",\"NOK\"))","v":"OK"},null,"",null,null,null,null,"NOK"]
["HAUS TINTAS E TEXTURAS LTDA","NF",45646,622.46,null,"bar 130120","2019-11-27",null,"25.144.267/0001-83","NOK",{"$f":"IF(A395=\"\",\"\",EDATE(TODAY(),-24))","v":"2018-08-03"},"OK","18.177.506/0001-36","46.79-6-01","Comércio varejista de materiais de construção em geral",null,622.46,"OK",null,"",null,null,null,null,{"$f":"IF(A395=\"\",\"\",IF(V395=\"OK\",\"OK\",IF(AND(J395=\"OK\",L395=\"OK\",P395=\"OK\",R395=\"OK\"),\"OK\",\"NOK\")))","v":"NOK"}]
["HAUS TINTAS E TEXTURAS LTDA","NF",45639,622.46,null,"bar 130120","2019-11-27",null,"25.144.267/0001-83","NOK","2018-08-03","OK","18.177.506/0001-36","46.79-6-01","Comércio varejista de materiais de construção em geral",null,622.46,"OK",null,"",null,null,null,null,"NOK"]
["HAUS TINTAS E TEXTURAS LTDA","NF",45647,497.96,null,"bar 130120","2019-11-27",null,"25.144.267/0001-83","NOK","2018-08-03","OK","18.177.506/0001-36","46.79-6-01","Comércio varejista de materiais de construção em geral",null,497.96,"OK",null,"",null,null,null,null,"NOK"]
["FERRARE ASSESSORIA LTDA","NF",178,11000,null,"bar 150120","2019-01-10",null,"25.144.267/0001-83","NOK","2018-08-03","OK","16.688.405/0001-02","43.11-8-01","Demolição de edifícios e outras estruturas",null,11000,"OK",null,"",null,null,null,null,"NOK"]
["CONSTROESTE CONSTRUTORA E PARTICIPACOES LTDA","NF",64061,910.8,null,"bar 160120","2019-10-18",null,"25.144.267/0001-83","NOK","2018-08-03","OK","06.291.846/0004-57","42.99-5-99","Comércio varejista de materiais de construção em geral",null,910.8,"OK",null,"",null,null,null,null,"NOK"]
["M.W. INDUSTRIA E COMERCIO DE PORTAS CORTA-FOGO LTDA","NF",61,11500,null,"bar 160120","2019-10-28",null,"25.144.267/0001-83","NOK","2018-08-03","OK","33.148.264/0001-46","43.30-4-02 ","Comércio varejista de materiais de construção em geral",null,11500,"OK",null,"",null,null,null,null,"NOK"]
["MEBRAS METAIS DO BRASIL EIRELI","NF",76326,31055.22,null,"bar 170120","2019-12-03",null,"25.144.267/0001-83","NOK","2018-08-03","OK","58.503.186/0001-81","24.23-7-01","Comércio varejista de materiais de construção em geral",null,31055.22,"OK",null,"",null,null,null,null,"NOK"]
["MORADA LAR E CONSTRUCAO LTDA","NF",3595,2916.66,null,"bar 200120","2019-01-15",null,"25.144.267/0001-83","NOK","2018-08-03","OK","27.488.256/0001-46","47.44-0-99","Comércio varejista de materiais de construção em geral",null,2916.66,"OK",null,"",null,null,null,null,"NOK"]
["AGROMETAL COMERCIAL DE FERRAGENS LTDA","NF",102273,1839,null,"bar 200120","2019-11-04",null,"25.144.267/0001-83","NOK","2018-08-03","OK","48.539.548/0007-26","47.44-0-99","Comércio varejista de materiais de construção em geral",null,1839,"OK",null,"",null,null,null,null,"NOK"]
["LAURO CESAR FERRAZ REVESTIMENTOS - EIRELI","NF",4328,6630,null,"bar 230120","2019-11-28",null,"25.144.267/0001-83","NOK","2018-08-03","OK","25.390.703/0001-02","47.44-0-05","Comércio varejista de materiais de construção não especificados anteriormente",null,6630,"OK",null,"",null,null,null,null,"NOK"]
["LAURO CESAR FERRAZ REVESTIMENTOS - EIRELI","NF",4326,35458.800000000003,null,"bar 230120","2019-11-28",null,"25.144.267/0001-83","NOK","2018-08-03","OK","25.390.703/0001-02","47.44-0-05","Comércio varejista de materiais de construção não especificados anteriormente",null,35458.800000000003,"OK",null,"",null,null,null,null,"NOK"]
["LAURO CESAR FERRAZ REVESTIMENTOS - EIRELI","NF",4327,5212,null,"bar 230120","2019-11-28",null,"25.144.267/0001-83","NOK","2018-08-03","OK","25.390.703/0001-02","47.44-0-05","Comércio varejista de materiais de construção não especificados anteriormente",null,5212,"OK",null,"",null,null,null,null,"NOK"]
["SERRALHERIA JB LTDA","NF",1441,20000,null,"bar 270120","2019-01-13",null,"25.144.267/0001-83","NOK","2018-08-03",{"$f":"IF(G407=\"\",\"\",IF(G407>=K407,\"OK\",\"NOK\"))","v":"OK"},"44.404.697/0001-31","25.12-8-00","Comércio varejista de materiais de construção em geral",null,20000,"OK",null,"",null,null,null,null,"NOK"]
["TUDO D'AGUA MATERIAIS PARA CONSTRUCAO LTDA.","NF",134066,10000,null,"bar 280120","2019-01-13",null,"25.144.267/0001-83",{"$f":"IF(I408=\"\",\"\",IF(OR(I408=H408,LEFT(H408,10)=LEFT(I408,10)),\"OK\",\"NOK\"))","v":"NOK"},"2018-08-03","OK","02.611.072/0001-09","47.44-0-99 ","Comércio varejista de materiais de construção em geral",null,10000,"OK",null,"",null,null,null,null,"NOK"]
["VITRAL VIDROS PLANOS LTDA","NF",495389,74361.34,null,"bar 290120","2019-10-01",null,"25.144.267/0001-83","NOK","2018-08-03","OK","71.821.169/0001-50","46.79-6-04","Comércio varejista de materiais de construção em geral",null,74361.34,"OK",null,"",null,null,null,null,"NOK"]
["TUDO D'AGUA MATERIAIS PARA CONSTRUCAO LTDA.","NF",133635,387.3,null,"bar 290120","2019-12-23",null,"25.144.267/0001-83","NOK","2018-08-03","OK","02.611.072/0001-09","47.44-0-99 ","Comércio varejista de materiais de construção em geral",null,387.3,"OK",null,"",null,null,null,null,"NOK"]
["JB FIRE COMERCIAL EIRELI","NF",2162,36147.47,null,"bar 310120","2020-01-15",null,"25.144.267/0001-83","NOK","2018-08-03","OK","27.233.695/0001-08","47.89-0-99 ","Comércio varejista de materiais de construção em geral",null,36147.47,"OK",null,"",null,null,null,null,"NOK"]
["CALIXTO SERVICOS EM GESSO EIRELI","NF",20,18220.8,null,"2020-03-02","2020-01-27",null,"25.144.267/0001-83","NOK","2018-08-03","OK","34.783.442/0001-73","43.30-4-03","Obras de acabamento em gesso e estuque",null,18220.8,"OK",null,"",null,null,null,null,"NOK"]
["CONDUMAX - ELETRO METALURGICA CIAFUNDI LTDA","NF",23127,21567.91,null,"2020-03-02","2020-01-31",null,"25.144.267/0001-83","NOK","2018-08-03","OK","53.224.127/0005-84","27.33-3-00","Fabricação de fios, cabos e condutores elétricos isolados",null,21567.91,"OK",null,"",null,null,null,null,"NOK"]
["CONDUMAX - ELETRO METALURGICA CIAFUNDI LTDA","NF",231188,4981.59,null,"2020-03-02","2020-01-31",null,"25.144.267/0001-83","NOK","2018-08-03","OK","53.224.127/0005-84","27.33-3-00","Fabricação de fios, cabos e condutores elétricos isolados",null,4981.59,"OK",null,"",null,null,null,null,"NOK"]
["CALIXTO SERVICOS EM GESSO EIRELI","NF",25,20753.72,null,"2020-03-02","2020-02-19",null,"25.144.267/0001-83","NOK","2018-08-03","OK","34.783.442/0001-73","43.30-4-03","Obras de acabamento em gesso e estuque",null,20753.72,"OK",null,"",null,null,null,null,"NOK"]
["FRIGELAR COMERCIO E INDUSTRIA LTDA","NF",417505,2769.85,null,"2020-03-03","2019-12-04",null,"25.144.267/0001-83","NOK","2018-08-03","OK","92.660.406/0020-81","47.57-1-00","Comércio varejista especializado de peças e acessórios para aparelhos eletroeletrônicos para uso doméstico, exceto informática e comunicação",null,2769.85,"OK",null,"",null,null,null,null,"NOK"]
["CONSTROESTE CONSTRUTORA E PARTICIPACOES LTDA","NF",69691,1335.52,null,"2020-03-04","2020-02-03",null,"25.144.267/0001-83","NOK","2018-08-03","OK","06.291.846/0004-57","42.99-5-99","Comércio varejista de materiais de construção em geral",null,1335.52,"OK",null,"",null,null,null,null,"NOK"]
["VOTORANTIM CIMENTOS S.A.","NF",242027,4361.5,null,"2020-03-05","2020-02-06",null,"25.144.267/0001-83","NOK","2018-08-03","OK","01.637.895/0058-78","46.74-5-00","Comércio atacadista de cimento",null,4361.5,"OK",null,"",null,null,null,null,"NOK"]
["CONSTROESTE CONSTRUTORA E PARTICIPACOES LTDA","NF",69991,500.82,null,"2020-03-09","2020-02-06",null,"25.144.267/0001-83","NOK","2018-08-03","OK","06.291.846/0004-57","42.99-5-99","Comércio varejista de materiais de construção em geral",null,500.82,"OK",null,"",null,null,null,null,"NOK"]
["JOSE ELIAS MORAIS","NF",2253,21636.720000000001,null,"2020-03-09","2020-02-27",null,"25.144.267/0001-83","NOK","2018-08-03","OK","55.580.310/0001-14","23.91-5-01 ","Britamento de pedras, exceto associado à extração - 213-5 - Empresário (Individual)",null,21636.720000000001,"OK",null,"",null,null,null,null,"NOK"]
["INDUSTRIA E COMERCIO DE TINTAS ROMA LTDA","NF",16394,1396,null,"2020-03-10","2020-02-19",null,"25.144.267/0001-83","NOK","2018-08-03","OK","72.866.528/0001-59","20.71-1-00","Fabricação de tintas, vernizes, esmaltes e lacas",null,1396,"OK",null,"",null,null,null,null,"NOK"]
["FERRARE ASSESSORIA LTDA","NF",184,11000,null,"2020-03-10","2020-03-04",null,"25.144.267/0001-83","NOK","2018-08-03","OK","16.688.405/0001-02","43.11-8-01","Demolição de edifícios e outras estruturas",null,11000,"OK",null,"",null,null,null,null,"NOK"]
["EXPANDIR CONSTRUTORA","NF",191,9220,null,"2020-03-12","2020-02-27",null,"25.144.267/0001-83","NOK","2018-08-03","OK","33.803.059/0001-77","43.99-1-03","Obras de alvenaria",null,9220,"OK",null,"",null,null,null,null,"NOK"]
["GOL BARRETOS CONSTRUCOES - EIRELI","NF",801,3234,null,"2020-03-16","2020-03-06",null,"25.144.267/0001-83","NOK","2018-08-03","OK","33.930.372/0001-76","47.44-0-99 ","Comércio varejista de materiais de construção em geral",null,3234,"OK",null,"",null,null,null,null,"NOK"]
["CASA TOGNINI MATERIAIS HIDRAULICOS E SANITARIOS LTDA","NF",397640,10232.86,null,"2020-03-19","2020-01-23",null,"25.144.267/0001-83","NOK","2018-08-03","OK","62.815.949/0001-05","47.44-0-99 ","Comércio varejista de materiais de construção em geral",null,10232.86,"OK",null,"",null,null,null,null,"NOK"]
["CASA TOGNINI MATERIAIS HIDRAULICOS E SANITARIOS LTDA","NF",397639,4028.91,null,"2020-03-19","2020-01-23",null,"25.144.267/0001-83","NOK","2018-08-03","OK","62.815.949/0001-05","47.44-0-99 ","Comércio varejista de materiais de construção em geral",null,4028.91,"OK",null,"",null,null,null,null,"NOK"]
["CASA TOGNINI MATERIAIS HIDRAULICOS E SANITARIOS LTDA","NF",397638,4927.2,null,"2020-03-19","2020-01-23",null,"25.144.267/0001-83","NOK","2018-08-03","OK","62.815.949/0001-05","47.44-0-99 ","Comércio varejista de materiais de construção em geral",null,4927.2,"OK",null,"",null,null,null,null,"NOK"]
["IMI HYDRONIC ENGENHARIA LTDA.","NF",20520,5912.91,null,"2020-03-19","2020-02-20",null,"25.144.267/0001-83","NOK","2018-08-03","OK","01.506.709/0001-26","47.44-0-99 ","Comércio varejista de materiais de construção em geral",null,5912.91,"OK",null,"",null,null,null,null,"NOK"]
["TERMOCOP INSTALACOES INDUSTRIAIS LTDA","NF",1467,14300,null,"2020-03-19","2020-02-20",null,"25.144.267/0001-83","NOK","2018-08-03","OK","04.924.675/0001-88","71.12-0-00 ","Serviços de engenharia",null,14300,"OK",null,"",null,null,null,null,"NOK"]
["ONITY LTDA.","NF",61,5760,null,"2020-03-19","2020-02-20",null,"25.144.267/0001-83","NOK","2018-08-03","OK","03.939.768/0003-85","46.72-9-00","Comércio atacadista de ferragens e ferramentas",null,5760,"OK",null,"",null,null,null,null,"NOK"]
["TERMOCOP INSTALACOES INDUSTRIAIS LTDA","NF",1468,6499.2,null,"2020-03-19","2020-02-20",null,"25.144.267/0001-83","NOK","2018-08-03","OK","04.924.675/0001-88","71.12-0-00 ","Serviços de engenharia",null,6499.2,"OK",null,"",null,null,null,null,"NOK"]
["GUAIRA COMERCIO DE TINTAS LTDA","NF",3438,4466,null,"2020-03-19","2020-02-18",null,"25.144.267/0001-83","NOK","2018-08-03","OK","72.697.501/0003-41","47.41-5-00","Comércio varejista de tintas e materiais para pintura",null,4466,"OK",null,{"$f":"IF(S432=\"\",\"\",IF(S432=E432,\"OK\",\"NOK\"))","v":""},null,null,null,null,"NOK"]
["AGROMETAL COMERCIAL DE FERRAGENS LTDA","NF",110767,522.37,null,"2020-03-20","2020-02-03",null,"25.144.267/0001-83","NOK","2018-08-03","OK","48.539.548/0007-26","47.44-0-99","Comércio varejista de materiais de construção em geral",null,522.37,"OK",null,"",null,null,null,null,"NOK"]
["TUDO D'AGUA MATERIAIS PARA CONSTRUCAO LTDA.","NF",135382,2012.59,null,"2020-03-20","2020-02-04",null,"25.144.267/0001-83","NOK","2018-08-03","OK","02.611.072/0001-09","47.44-0-99 ","Comércio varejista de materiais de construção em geral",null,2012.59,"OK",null,"",null,null,null,null,"NOK"]
["CALIXTO SERVICOS EM GESSO EIRELI","NF",26,1000,null,"2020-03-23","2020-03-13",null,"25.144.267/0001-83",{"$f":"IF(I435=\"\",\"\",IF(OR(I435=H435,LEFT(H435,10)=LEFT(I435,10)),\"OK\",\"NOK\"))","v":"NOK"},{"$f":"IF(A435=\"\",\"\",EDATE(TODAY(),-24))","v":"2018-08-03"},{"$f":"IF(G435=\"\",\"\",IF(G435>=K435,\"OK\",\"NOK\"))","v":"OK"},"34.783.442/0001-73","43.30-4-03","Obras de acabamento em gesso e estuque",null,1000,"OK",null,"",null,null,null,null,"NOK"]
["TUDO D'AGUA MATERIAIS PARA CONSTRUCAO LTDA.","NF",136627,278.95,null,"2020-03-26","2020-02-27",null,"25.144.267/0001-83","NOK","2018-08-03","OK","02.611.072/0001-09","47.44-0-99 ","Comércio varejista de materiais de construção em geral",null,278.95,"OK",null,"",null,null,null,null,"NOK"]
["ELIAS GARCIA DE SOUZA 85195057168","NF",75,2500,null,"2020-03-31","2020-03-06",null,"25.144.267/0001-83","NOK","2018-08-03","OK","30.815.826/0001-70","47.44-0-99 ","Comércio varejista de materiais de construção em geral",null,2500,"OK",null,"",null,null,null,null,"NOK"]
["FRIGELAR COMERCIO E INDUSTRIA LTDA","NF",416892,9242.52,null,"2020-03-31","2019-12-02",null,"25.144.267/0001-83","NOK","2018-08-03","OK","92.660.406/0020-81","47.44-0-99 ","Comércio varejista de materiais de construção em geral",null,9242.52,"OK",null,"",null,null,null,null,"NOK"]
["MERCADO DO ALUMINIO EIRELI","NF",416892,12075,null,"2020-ABR.01-04","2020-03-05",null,"25.144.267/0001-83","NOK","2018-08-03","OK","02.436.718/0001-50","47.44-0-99 ","Comércio varejista de materiais de construção em geral",null,12075,"OK",null,"",null,null,null,null,"NOK"]
["ANTONIO CARLOS FERREIRA VARES","NF","000.003.404",500,null,"2020-ABR.002-04","2020-02-26",null,"25.144.267/0001-83","NOK","2018-08-03","OK","17.103.799/0001-44","47.44-0-99 ","Comércio varejista de materiais de construção em geral",null,500,"OK",null,"",null,null,null,null,"NOK"]
["R. P. INDUSTRIA E COMERCIO DE ARTEFATOS DE CIMENTO LTDA","NF",962,200,null,"2020-ABR.002-04","2020-03-03",null,"25.144.267/0001-83","NOK","2018-08-03","OK","14.264.380/0001-86","47.44-0-99 ","Comércio varejista de materiais de construção em geral",null,200,"OK",null,"",null,null,null,null,"NOK"]
["RENTSERVICE LOCACAO DE EQUIPAMENTOS LTDA","NF",5331,140,null,"2020-ABR.003-04","2020-02-26",null,"25.144.267/0001-83","NOK","2018-08-03","OK","32.397.210/0001-51","33.14-7-99","Manutenção e reparação de outras máquinas e equipamentos para usos industriais não especificados anteriormente",null,140,{"$f":"IF(Q442=\"\",\"\",IF(Q442=D442,\"OK\",\"NOK\"))","v":"OK"},null,"",null,null,null,null,"NOK"]
["RENTSERVICE LOCACAO DE EQUIPAMENTOS LTDA","NF",5320,140,null,"2020-ABR.003-04","2020-01-27",null,"25.144.267/0001-83","NOK",{"$f":"IF(A443=\"\",\"\",EDATE(TODAY(),-24))","v":"2018-08-03"},"OK","32.397.210/0001-51","33.14-7-99","Manutenção e reparação de outras máquinas e equipamentos para usos industriais não especificados anteriormente",null,140,"OK",null,"",null,null,null,null,{"$f":"IF(A443=\"\",\"\",IF(V443=\"OK\",\"OK\",IF(AND(J443=\"OK\",L443=\"OK\",P443=\"OK\",R443=\"OK\"),\"OK\",\"NOK\")))","v":"NOK"}]
["MILTON CARLOS FRIGO","NF",1147,13277.4,null,"2020-ABR.006-04","2020-02-14",null,"25.144.267/0001-83","NOK","2018-08-03","OK","13.330.722/0001-56","43.21-5-00","Instalação e manutenção elétrica",null,13277.4,"OK",null,"",null,null,null,null,"NOK"]
["FERRARE ASSESSORIA LTDA","NF",187,7700,null,"2020-ABR.009-04","2020-04-01",null,"25.144.267/0001-83","NOK","2018-08-03","OK","16.688.405/0001-02","43.11-8-01","Demolição de edifícios e outras estruturas",null,7700,"OK",null,"",null,null,null,null,"NOK"]
["MULTISHINE ATELIE QUIMICO EIRELI","NF",8179,240.45,null,"2020-ABR.013-04","2020-03-10",null,"25.144.267/0001-83","NOK","2018-08-03","OK","30.547.201/0001-74","47.89-0-05","Comércio varejista de produtos saneantes domissanitários",null,240.45,"OK",null,"",null,null,null,null,"NOK"]
["MULTISHINE ATELIE QUIMICO EIRELI","NF",8209,60.2,null,"2020-ABR.013-04","2020-03-12",null,"25.144.267/0001-83","NOK","2018-08-03","OK","30.547.201/0001-74","47.89-0-05","Comércio varejista de produtos saneantes domissanitários",null,60.2,"OK",null,"",null,null,null,null,"NOK"]
["JB FIRE COMERCIAL EIRELI","NF",2309,2589.54,null,"2020-ABR.013-04","2020-03-16",null,"25.144.267/0001-83","NOK","2018-08-03","OK","27.233.695/0001-08","47.89-0-99 ","Comércio varejista de materiais de construção em geral",null,2589.54,"OK",null,"",null,null,null,null,"NOK"]
["TREVAO HOME CENTER LTDA","NF",102828,901,null,"2020-ABR.013-04","2020-03-13",null,"25.144.267/0001-83","NOK","2018-08-03","OK","59.567.396/0001-04","47.44-0-05","Comércio varejista de materiais de construção não especificados anteriormente",null,901,"OK",null,"",null,null,null,null,"NOK"]
["TOPPING FORROS - EIRELI","NF",14194,6246,null,"2020-ABR.013-04","2020-02-14",null,"25.144.267/0001-83","NOK","2018-08-03","OK","05.145.178/0001-44","43.30-4-03","Obras de acabamento em gesso e estuque",null,6246,"OK",null,"",null,null,null,null,"NOK"]
["ANTONIO CARLOS FERREIRA VARES","NF","000.003.455",210,null,"2020-ABR.013-04","2020-03-16",null,"25.144.267/0001-83","NOK","2018-08-03","OK","17.103.799/0001-44","47.44-0-02","Comércio varejista de madeira e artefatos",null,210,"OK",null,"",null,null,null,null,"NOK"]
["EXPANDIR CONSTRUTORA","NF",221,10000,null,"2020-ABR.013-04","2020-03-09",null,"25.144.267/0001-83","NOK","2018-08-03","OK","33.803.059/0001-77","43.99-1-03","Obras de alvenaria",null,10000,"OK",null,"",null,null,null,null,"NOK"]
["CONSTROESTE CONSTRUTORA E PARTICIPACOES LTDA","NF",71631,942.72,null,"2020-ABR.015-04","2020-03-04",null,"25.144.267/0001-83","NOK","2018-08-03","OK","06.291.846/0004-57","42.99-5-99","Comércio varejista de materiais de construção em geral",null,942.72,"OK",null,"",null,null,null,null,"NOK"]
["CONSTROESTE CONSTRUTORA E PARTICIPACOES LTDA","NF",71851,471.36,null,"2020-ABR.015-04","2020-03-09",null,"25.144.267/0001-83","NOK","2018-08-03","OK","06.291.846/0004-57","42.99-5-99","Comércio varejista de materiais de construção em geral",null,471.36,"OK",null,"",null,null,null,null,"NOK"]
["CONSTROESTE CONSTRUTORA E PARTICIPACOES LTDA","NF",72271,628.48,null,"2020-ABR.015-04","2020-03-12",null,"25.144.267/0001-83","NOK","2018-08-03","OK","06.291.846/0004-57","42.99-5-99","Comércio varejista de materiais de construção em geral",null,628.48,"OK",null,"",null,null,null,null,"NOK"]
["CONSTROESTE CONSTRUTORA E PARTICIPACOES LTDA","NF",72821,628.48,null,"2020-ABR.015-04","2020-03-17",null,"25.144.267/0001-83","NOK","2018-08-03","OK","06.291.846/0004-57","42.99-5-99","Comércio varejista de materiais de construção em geral",null,628.48,"OK",null,"",null,null,null,null,"NOK"]
["VOTORANTIM CIMENTOS S.A.","NF",243890,5542.2,null,"2020-ABR.015-04","2020-03-02",null,"25.144.267/0001-83","NOK","2018-08-03","OK","01.637.895/0058-78","46.74-5-00","Comércio atacadista de cimento",null,5542.2,"OK",null,"",null,null,null,null,"NOK"]
["VOTORANTIM CIMENTOS S.A.","NF",244510,4930.8,null,"2020-ABR.015-04","2020-03-10",null,"25.144.267/0001-83","NOK","2018-08-03","OK","01.637.895/0058-78","46.74-5-00","Comércio atacadista de cimento",null,4930.8,"OK",null,"",null,null,null,null,"NOK"]
["M.F. DE OLIVEIRA","NF",431,2807.04,null,"2020-ABR.015-04","2020-03-11",null,"25.144.267/0001-83","NOK","2018-08-03","OK","23.578.004/0001-57","25.39-0-02","Serviços de tratamento e revestimento em metais",null,2807.04,"OK",null,"",null,null,null,null,"NOK"]
["COMAP MATERIAIS PARA CONSTRUCOES LTDA","NF",49719,622,null,"2020-ABR.017-04","2020-03-11",null,"25.144.267/0001-83","NOK","2018-08-03","OK","48.447.627/0001-11","47.44-0-05","Comércio varejista de materiais de construção não especificados anteriormente",null,622,"OK",null,"",null,null,null,null,"NOK"]
["COMAP MATERIAIS PARA CONSTRUCOES LTDA","NF",49720,82.42,null,"2020-ABR.017-04","2020-03-11",null,"25.144.267/0001-83","NOK","2018-08-03","OK","48.447.627/0001-11","47.44-0-05","Comércio varejista de materiais de construção não especificados anteriormente",null,82.42,"OK",null,"",null,null,null,null,"NOK"]
["COMAP MATERIAIS PARA CONSTRUCOES LTDA","NF",49728,1837.37,null,"2020-ABR.017-04","2020-03-11",null,"25.144.267/0001-83","NOK","2018-08-03","OK","48.447.627/0001-11","47.44-0-05","Comércio varejista de materiais de construção não especificados anteriormente",null,1837.37,"OK",null,"",null,null,null,null,"NOK"]
["ALAIR MUNIZ DUTRA E FILHOS EXTRACAO LTDA","NF",17447,300,null,"2020-ABR.017-04","2020-02-19",null,"25.144.267/0001-83","NOK","2018-08-03","OK","10.727.024/0001-09","08.10-0-06 ","Extração de areia, cascalho ou pedregulho e beneficiamento associado",null,300,"OK",null,"",null,null,null,null,"NOK"]
["ANTONIO CARLOS FERREIRA VARES","NF","000.003.467",380,null,"2020-ABR.017-04","2020-03-18",null,"25.144.267/0001-83","NOK","2018-08-03",{"$f":"IF(G464=\"\",\"\",IF(G464>=K464,\"OK\",\"NOK\"))","v":"OK"},"17.103.799/0001-44","47.44-0-02","Comércio varejista de madeira e artefatos",null,380,"OK",null,"",null,null,null,null,"NOK"]
["IGM PRESTACAO DE SERVICOS LTDA","NF",2282,17247.8,null,"2020-ABR.027-04","2020-02-07",null,"25.144.267/0001-83",{"$f":"IF(I465=\"\",\"\",IF(OR(I465=H465,LEFT(H465,10)=LEFT(I465,10)),\"OK\",\"NOK\"))","v":"NOK"},"2018-08-03","OK","13.482.569/0001-82","16.22-6-02","Fabricação de esquadrias de madeira e de peças de madeira para instalações industriais e comerciais",null,17247.8,"OK",null,"",null,null,null,null,"NOK"]
["EXPANDIR CONSTRUTORA","NF",231,12908,null,"2020-05-04","2020-03-09",null,"25.144.267/0001-83","NOK","2018-08-03","OK","33.803.059/0001-77","43.99-1-03","Obras de alvenaria",null,12908,"OK",null,"",null,null,null,null,"NOK"]
["CONSTROESTE CONSTRUTORA E PARTICIPACOES LTDA","NF",71901,2700.5,null,"2020-05-04","2020-03-09",null,"25.144.267/0001-83","NOK","2018-08-03","OK","06.291.846/0004-57","47.44-0-99 ","Comércio varejista de materiais de construção em geral",null,2700.5,"OK",null,"",null,null,null,null,"NOK"]
["CONSTROESTE CONSTRUTORA E PARTICIPACOES LTDA","NF",73311,962.36,null,"2020-05-04","2020-03-24",null,"25.144.267/0001-83","NOK","2018-08-03","OK","06.291.846/0004-57","47.44-0-99 ","Comércio varejista de materiais de construção em geral",null,962.36,"OK",null,"",null,null,null,null,"NOK"]
["AQUALAX COMERCIO DE BANHEIRAS LTDA","NF",4204,14500,null,"2020-05-04","2020-02-13",null,"25.144.267/0001-83","NOK","2018-08-03","OK","14.926.337/0001-39","47.44-0-99 ","Comércio varejista de materiais de construção em geral",null,14500,"OK",null,"",null,null,null,null,"NOK"]
["CALIXTO SERVICOS EM GESSO EIRELI","NF",28,24331.8,null,"2020-05-04","2020-03-23",null,"25.144.267/0001-83","NOK","2018-08-03","OK","34.783.442/0001-73","43.30-4-03","Obras de acabamento em gesso e estuque",null,24331.8,"OK",null,"",null,null,null,null,"NOK"]
["ELIAS GARCIA DE SOUZA 85195057168","NF",76,2500,null,"2020-05-04","2020-04-09",null,"25.144.267/0001-83","NOK","2018-08-03","OK","30.815.826/0001-70","43.30-4-04 ","Serviços de pintura de edifícios em geral",null,2500,"OK",null,"",null,null,null,null,"NOK"]
["SERRALHERIA JB LTDA","NF",1449,10000,null,"2020-05-04","2020-03-24",null,"25.144.267/0001-83","NOK","2018-08-03","OK","44.404.697/0001-31","25.12-8-00","Comércio varejista de materiais de construção em geral",null,10000,"OK",null,"",null,null,null,null,"NOK"]
["RENTSERVICE LOCACAO DE EQUIPAMENTOS LTDA","NF",8845,5106.96,null,"2020-05-08","2020-03-30",null,"25.144.267/0001-83","NOK","2018-08-03","OK","32.397.210/0001-51","33.14-7-99","Manutenção e reparação de outras máquinas e equipamentos para usos industriais não especificados anteriormente",null,5106.96,"OK",null,"",null,null,null,null,"NOK"]
["RENTSERVICE LOCACAO DE EQUIPAMENTOS LTDA","NF",8296,5325,null,"2020-05-08","2020-03-06",null,"25.144.267/0001-83","NOK","2018-08-03","OK","32.397.210/0001-51","33.14-7-99","Manutenção e reparação de outras máquinas e equipamentos para usos industriais não especificados anteriormente",null,5325,"OK",null,"",null,null,null,null,"NOK"]
["CONSTROESTE CONSTRUTORA E PARTICIPACOES LTDA","NF",71981,2700.5,null,"2020-05-08","2020-03-09",null,"25.144.267/0001-83","NOK","2018-08-03","OK","06.291.846/0004-57","42.99-5-99","Comércio varejista de materiais de construção em geral",null,2700.5,"OK",null,"",null,null,null,null,"NOK"]
["FERRARE ASSESSORIA LTDA","NF",190,7700,null,"2020-05-11","2019-05-04",null,"25.144.267/0001-83","NOK","2018-08-03","OK","16.688.405/0001-02","43.11-8-01","Demolição de edifícios e outras estruturas",null,7700,"OK",null,"",null,null,null,null,"NOK"]
["CONSTROESTE CONSTRUTORA E PARTICIPACOES LTDA","NF",73191,628.48,null,"2020-05-19","2020-03-20",null,"25.144.267/0001-83","NOK","2018-08-03","OK","06.291.846/0004-57","42.99-5-99","Comércio varejista de materiais de construção em geral",null,628.48,"OK",null,"",null,null,null,null,"NOK"]
["EXPANDIR CONSTRUTORA","NF",251,3872.4,null,"2020-05-22","2020-05-20",null,"25.144.267/0001-83","NOK","2018-08-03","OK","33.803.059/0001-77","43.99-1-03","Obras de alvenaria",null,3872.4,"OK",null,"",null,null,null,null,"NOK"]
["RENTSERVICE LOCACAO DE EQUIPAMENTOS LTDA","NF",9434,5106.96,null,"2020-05-27","2019-04-27",null,"25.144.267/0001-83","NOK","2018-08-03","OK","32.397.210/0001-51","33.14-7-99","Manutenção e reparação de outras máquinas e equipamentos para usos industriais não especificados anteriormente",null,5106.96,"OK",null,"",null,null,null,null,"NOK"]
["EXPANDIR CONSTRUTORA","NF",261,3872.4,null,"2020-05-29","2020-05-26",null,"25.144.267/0001-83","NOK","2018-08-03","OK","33.803.059/0001-77","43.99-1-03","Obras de alvenaria",null,3872.4,"OK",null,"",null,null,null,null,"NOK"]
["RENTSERVICE LOCACAO DE EQUIPAMENTOS LTDA","NF",9663,5325,null,"2020-06-02","2020-05-05",null,"25.144.267/0001-83","NOK","2018-08-03","OK","32.397.210/0001-51","33.14-7-99","Manutenção e reparação de outras máquinas e equipamentos para usos industriais não especificados anteriormente",null,5325,"OK",null,"",null,null,null,null,"NOK"]
["RENTSERVICE LOCACAO DE EQUIPAMENTOS LTDA","NF",9000,5325,null,"2020-06-05","2020-04-06",null,"25.144.267/0001-83","NOK","2018-08-03","OK","32.397.210/0001-51","33.14-7-99","Manutenção e reparação de outras máquinas e equipamentos para usos industriais não especificados anteriormente",null,5325,"OK",null,"",null,null,null,null,"NOK"]
["VOTORANTIM CIMENTOS S.A.","NF",250193,5026,null,"2020-06-05","2020-05-15",null,"25.144.267/0001-83","NOK","2018-08-03","OK","01.637.895/0058-78","46.74-5-00","Comércio atacadista de cimento",null,5026,"OK",null,"",null,null,null,null,"NOK"]
["EXPANDIR CONSTRUTORA","NF",271,3872.4,null,"2020-06-05","2020-06-02",null,"25.144.267/0001-83","NOK","2018-08-03","OK","33.803.059/0001-77","43.99-1-03","Obras de alvenaria",null,3872.4,"OK",null,"",null,null,null,null,"NOK"]
["CECRISA REVEST. CERAMICO S.A","NF",19012,3757.44,null,"2020-06-08","2020-03-19",null,"25.144.267/0001-83","NOK","2018-08-03","OK","79.655.916/0046-31","46.79-6-04 ","Comércio atacadista especializado de materiais de construção não especificados anteriormente",null,3757.44,"OK",null,"",null,null,null,null,"NOK"]
["INDUSTRIA E COMERCIO DE TINTAS ROMA LTDA","NF",16750,1377.94,null,"2020-06-08","2020-05-07",null,"25.144.267/0001-83","NOK","2018-08-03","OK","72.866.528/0001-59","20.71-1-00","Fabricação de tintas, vernizes, esmaltes e lacas",null,1377.94,"OK",null,"",null,null,null,null,"NOK"]
["R&JR ARQUITETURA E ENGENHARIA LTDA ME","NF",649,3000,null,"2020-06-15","2020-05-06",null,"25.144.267/0001-83","NOK","2018-08-03","OK","04.403.128/0001-57","43.99-1-01 ","Administração de obras",null,3000,"OK",null,{"$f":"IF(S487=\"\",\"\",IF(S487=E487,\"OK\",\"NOK\"))","v":""},null,null,null,null,"NOK"]
["MILIMETRO COMERCIO DE FERRAGENS E ACESSORIOS LTDA","NF",4057,2940.75,null,"2020-06-15","2020-05-08",null,"25.144.267/0001-83","NOK","2018-08-03","OK","11.134.323/0001-94","47.44-0-01","Comércio varejista de ferragens e ferramentas",null,2940.75,"OK",null,"",null,null,null,null,"NOK"]
["INDUSTRIA E COMERCIO DE TINTAS ROMA LTDA","NF",16823,145.09,null,"2020-06-19","2020-05-20",null,"25.144.267/0001-83","NOK","2018-08-03","OK","72.866.528/0001-59","20.71-1-00","Fabricação de tintas, vernizes, esmaltes e lacas",null,145.09,"OK",null,"",null,null,null,null,"NOK"]
["EXPANDIR CONSTRUTORA","NF",291,3872.4,null,"2020-06-22","2020-06-17",null,"25.144.267/0001-83","NOK","2018-08-03","OK","33.803.059/0001-77","43.99-1-03","Obras de alvenaria",null,3872.4,"OK",null,"",null,null,null,null,"NOK"]
["ELIAS GARCIA DE SOUZA 85195057168","NF",80,5000,null,"2020-06-26","2020-06-11",null,"25.144.267/0001-83","NOK","2018-08-03","OK","30.815.826/0001-70","43.30-4-04 ","Serviços de pintura de edifícios em geral",null,5000,"OK",null,"",null,null,null,null,"NOK"]
["EXPANDIR CONSTRUTORA","NF",311,22128,null,"2020-06-30","2020-06-24",null,"25.144.267/0001-83","NOK","2018-08-03","OK","33.803.059/0001-77","43.99-1-03","Obras de alvenaria",null,22128,"OK",null,"",null,null,null,null,"NOK"]
["R. L. P. MILANES","NF",1894,2115.04,null,"bar 311018","2018-10-04",null,"25.144.267/0001-83","NOK","2018-08-03","OK","15.136.730/0001-91","43.22-3-01","Comércio varejista de material elétrico",null,2115.04,"OK",null,"",null,null,null,null,"NOK"]
["AGROMETAL COMERCIAL DE FERRAGENS LTDA","NF",66705,1479.33,null,"bar 311018","2018-10-15",null,"25.144.267/0001-83","NOK","2018-08-03","OK","48.539.548/0007-26","47.44-0-99","Comércio varejista de materiais de construção em geral",null,1479.33,"OK",null,"",null,null,null,null,"NOK"]
["VOTORANTIM CIMENTOS S.A.","NF",199845,5253.77,null,"bar 311018","2018-09-18",null,"25.144.267/0001-83","NOK","2018-08-03","OK","01.637.895/0058-78","46.74-5-00","Comércio atacadista de cimento",null,5253.77,"OK",null,"",null,null,null,null,"NOK"]
["VOTORANTIM CIMENTOS S.A.","NF",199152,5341.04,null,"bar 011118","2018-09-06",null,"25.144.267/0001-83","NOK","2018-08-03","OK","01.637.895/0058-78","46.74-5-00"," Comércio atacadista de cimento",null,5341.04,"OK",null,"",null,null,null,null,"NOK"]
["CB DESIGN INDUSTRIA E COMERCIO EIRELI","NF",5453,33422.379999999997,null,"bar 011118","2018-10-04",null,"25.144.267/0001-83","NOK",{"$f":"IF(A497=\"\",\"\",EDATE(TODAY(),-24))","v":"2018-08-03"},"OK","16.569.653/0001-26","25.99-3-99","Fabricação de outros produtos de metal não especificados anteriormente",null,33422.379999999997,{"$f":"IF(Q497=\"\",\"\",IF(Q497=D497,\"OK\",\"NOK\"))","v":"OK"},null,"",null,null,null,null,{"$f":"IF(A497=\"\",\"\",IF(V497=\"OK\",\"OK\",IF(AND(J497=\"OK\",L497=\"OK\",P497=\"OK\",R497=\"OK\"),\"OK\",\"NOK\")))","v":"NOK"}]
["M.C.M CONSTRUCOES METALICAS","NF",47,31987.81,null,"bar 011118","2018-10-26",null,"25.144.267/0001-83","NOK","2018-08-03","OK","13.453.658/0001-09","42.92-8-01","Montagem de estruturas metálicas",null,31987.81,"OK",null,"",null,null,null,null,"NOK"]
["TUDO D'AGUA MATERIAIS PARA CONSTRUCAO LTDA.","NF",111996,8000,null,"bar 051118 part 2","2018-09-05",null,"25.144.267/0001-83","NOK","2018-08-03","OK","02.611.072/0001-09","47.44-0-99","Comércio varejista de materiais de construção em geral",null,8000,"OK",null,"",null,null,null,null,"NOK"]
["TUDO D'AGUA MATERIAIS PARA CONSTRUCAO LTDA.","NF",111997,10000,null,"bar 051118 part 2","2018-09-05",null,"25.144.267/0001-83","NOK","2018-08-03","OK","02.611.072/0001-09","47.44-0-99","Comércio varejista de materiais de construção em geral",null,10000,"OK",null,"",null,null,null,null,"NOK"]
["R. L. P. MILANES","NF",1896,11760.4,null,"bar 051118 part 2","2018-10-05",null,"25.144.267/0001-83","NOK","2018-08-03","OK","15.136.730/0001-91","47.42-3-00","Comércio varejista de material elétrico",null,11760.4,"OK",null,"",null,null,null,null,"NOK"]
["R. L. P. MILANES","NF",1895,12400,null,"bar 051118 part 2","2018-10-05",null,"25.144.267/0001-83","NOK","2018-08-03","OK","15.136.730/0001-91","47.42-3-00","Comércio varejista de material elétrico",null,12400,"OK",null,"",null,null,null,null,"NOK"]
["R. L. P. MILANES","NF",1893,7480,null,"bar 051118 part 2","2018-10-05",null,"25.144.267/0001-83","NOK","2018-08-03","OK","15.136.730/0001-91","47.42-3-00","Comércio varejista de material elétrico",null,7480,"OK",null,"",null,null,null,null,"NOK"]
["ELETRO REDE MATERIAIS ELETRICOS LTDA","NF",7075,19880,null,"bar 051118 part 2","2018-10-05",null,"25.144.267/0001-83","NOK","2018-08-03","OK","12.576.270/0001-24","47.42-3-00","Comércio varejista de material elétrico",null,19880,"OK",null,"",null,null,null,null,"NOK"]
["ELETRO REDE MATERIAIS ELETRICOS LTDA","NF",7090,3726.1,null,"bar 051118 part 2","2018-10-05",null,"25.144.267/0001-83","NOK","2018-08-03","OK","12.576.270/0001-24","47.42-3-00","Comércio varejista de material elétrico",null,3726.1,"OK",null,"",null,null,null,null,"NOK"]
["CS INDUSTRIA DE KIT PORTA PRONTA LTDA","NF",119,11357.96,null,"bar 071118","2018-10-05",null,"25.144.267/0001-83","NOK","2018-08-03","OK","04.908.931/0001-43","43.30-4-02","nstalação de portas, janelas, tetos, divisórias e armários embutidos de qualquer material",null,11357.96,"OK",null,"",null,null,null,null,"NOK"]
["FRIGO & CARDOSO EXTINTORES LTDA","NF",3481,14500,null,"bar 071118","2018-10-05",null,"25.144.267/0001-83","NOK","2018-08-03","OK","18.625.636/0001-94","47.89-0-99","Comércio varejista de outros produtos não especificados anteriormente",null,14500,"OK",null,"",null,null,null,null,"NOK"]
["EBARA BOMBAS AMERICA DO SUL LTDA","NF",2874,1616.18,null,"bar 071118","2018-10-05",null,"25.144.267/0001-83","NOK","2018-08-03","OK","46.138.319/0007-74","28.12-7-00","Fabricação de equipamentos hidráulicos e pneumáticos, peças e acessórios, exceto válvulas",null,1616.18,"OK",null,"",null,null,null,null,"NOK"]
["EBARA BOMBAS AMERICA DO SUL LTDA","NF",22,3730.3,null,"bar 071118","2018-10-05",null,"25.144.267/0001-83","NOK","2018-08-03","OK","46.138.319/0007-74","28.12-7-00","Fabricação de equipamentos hidráulicos e pneumáticos, peças e acessórios, exceto válvulas",null,3730.3,"OK",null,"",null,null,null,null,"NOK"]
["FRIGO & CARDOSO EXTINTORES LTDA","NF",3445,11170,null,"bar 081118","2018-10-11",null,"25.144.267/0001-83","NOK","2018-08-03","OK","18.625.636/0001-94","47.89-0-99","Comércio varejista de outros produtos não especificados anteriormente",null,11170,"OK",null,"",null,null,null,null,"NOK"]
["TUDO D'AGUA MATERIAIS PARA CONSTRUCAO LTDA.","NF",109737,74139.12,null,"bar 091118","2018-09-05",null,"25.144.267/0001-83","NOK","2018-08-03","OK","02.611.072/0001-09","47.44-0-99","Comércio varejista de materiais de construção em geral",null,74139.12,"OK",null,"",null,null,null,null,"NOK"]
["GESSO NORTE LTDA","NF",72,12904,null,"bar 091118","2018-09-05",null,"25.144.267/0001-83","NOK","2018-08-03","OK","02.084.973/0001-81","46.79-6-04","Comércio atacadista especializado de materiais de construção não especificados anteriormente",null,12904,"OK",null,"",null,null,null,null,"NOK"]
["ELIAS GARCIA DE SOUZA 85195057168","NF",9,2500,null,"bar 091118","2018-09-05",null,"25.144.267/0001-83","NOK","2018-08-03","OK","30.815.826/0001-70","43.30-4-04","Serviços de pintura de edifícios em geral",null,2500,"OK",null,"",null,null,null,null,"NOK"]
["AQUALAX COMERCIO DE BANHEIRAS LTDA","NF",3059,14000,null,"bar 091118","2018-09-05",null,"25.144.267/0001-83","NOK","2018-08-03","OK","14.926.337/0001-39","22.29-3-03"," Fabricação de artefatos de material plástico para uso na construção, exceto tubos e acessórios",null,14000,"OK",null,"",null,null,null,null,"NOK"]
["PAULO RADAMES BELCARI DE MELO","NF",45,6615,null,"bar 121118","2018-11-06",null,"25.144.267/0001-83","NOK","2018-08-03","OK","28.288.408/0001-20","43.30-4-04","Serviços de pintura de edifícios em geral",null,6615,"OK",null,"",null,null,null,null,"NOK"]
["GOL CACAMBA & TERRAPLENAGEM BARRETOS - EIRELI","NF",3861,2469.6,null,"bar 121118","2018-11-06",null,"25.144.267/0001-83","NOK","2018-08-03","OK","14.794.870/0001-94","38.11-4-00 "," Coleta de resíduos não-perigosos",null,2469.6,"OK",null,"","Locação de caçambas",null,null,null,"NOK"]
["AGROMETAL COMERCIAL DE FERRAGENS LTDA","NF",66684,2064.59,null,"bar 121118","2018-10-13",null,"25.144.267/0001-83","NOK","2018-08-03","OK","48.539.548/0007-26","47.44-0-99","Comércio varejista de materiais de construção em geral",null,2064.59,"OK",null,"",null,null,null,null,"NOK"]
["TRANSVOLT'S - MOTORES E TRANSFORMADORES LTDA","NF",14442,12388.19,null,"bar 121118","2018-09-13",null,"25.144.267/0001-83","NOK","2018-08-03",{"$f":"IF(G518=\"\",\"\",IF(G518>=K518,\"OK\",\"NOK\"))","v":"OK"},"50.506.005/0001-69","47.42-3-00","Comércio varejista de material elétrico",null,12388.19,"OK",null,"",null,null,null,null,"NOK"]
["FERRARE ASSESSORIA LTDA","NF",135,13000,null,"bar 131118","2018-11-02",null,"25.144.267/0001-83",{"$f":"IF(I519=\"\",\"\",IF(OR(I519=H519,LEFT(H519,10)=LEFT(I519,10)),\"OK\",\"NOK\"))","v":"NOK"},"2018-08-03","OK","16.688.405/0001-02","43.11-8-01 ","Demolição de edifícios e outras estruturas",null,13000,"OK",null,"",null,null,null,null,"NOK"]
["MLS GERENCIAMENTO DE OBRAS LTDA","NF",300,54908.11,null,"bar 161118","2018-11-11",null,"25.144.267/0001-83","NOK","2018-08-03","OK","14.545.614/0001-63","41.20-4-00 ","Construção de edifícios",null,54908.11,"OK",null,"",null,null,null,null,"NOK"]
["ELIANE REVESTIMENTOS CERAMICOS LTDA","NF",517574,1345.73,null,"bar 161118","2018-09-21",null,"25.144.267/0001-83","NOK","2018-08-03","OK","86.532.538/0030-05","23.42-7-01","Fabricação de azulejos e pisos",null,1345.73,"OK",null,"",null,null,null,null,"NOK"]
["GESSO NORTE LTDA","NF",164,27946.15,null,"bar 191118","2018-10-04",null,"25.144.267/0001-83","NOK","2018-08-03","OK","02.084.973/0001-81","46.79-6-04","Comércio atacadista especializado de materiais de construção não especificados anteriormente",null,27946.15,"OK",null,"",null,null,null,null,"NOK"]
["DECON CONSTRUTORA LTDA","NF",1761,28350,null,"bar 191118","2018-10-17",null,"25.144.267/0001-83","NOK","2018-08-03","OK","11.125.856/0001-00","41.20-4-00 ","Construção de edifícios",null,28350,"OK",null,"",null,null,null,null,"NOK"]
["PAULO RADAMES BELCARI DE MELO","NF",37,20394.2,null,"bar 191118","2018-10-01",null,"25.144.267/0001-83","NOK","2018-08-03","OK","28.288.408/0001-20","43.30-4-04","Serviços de pintura de edifícios em geral",null,20394.2,"OK",null,"",null,null,null,null,"NOK"]
["TEKHTON SOLUCOES EM ENGENHARIA LTDA","NF",211,18208.07,null,"bar 191118","2018-10-01",null,"25.144.267/0001-83","NOK","2018-08-03","OK","27.739.912/0001-36","71.12-0-00","Serviços de engenharia",null,18208.07,"OK",null,"",null,null,null,null,"NOK"]
["SETE SERVICOS TECNICOS DE ENGENHARIA LTDA","NF",3857,3000,null,"bar 191118","2018-10-10",null,"25.144.267/0001-83","NOK","2018-08-03","OK","37.264.066/0001-07","71.12-0-00","Serviços de engenharia",null,3000,"OK",null,"",null,null,null,null,"NOK"]
["INDUSTRIA E COMERCIO DE TINTAS ROMA LTDA","NF",14125,5086,null,"bar 191118","2018-10-19",null,"25.144.267/0001-83","NOK","2018-08-03","OK","72.866.528/0001-59","20.71-1-00 ","Fabricação de tintas, vernizes, esmaltes e lacas",null,5086,"OK",null,"",null,null,null,null,"NOK"]
["FRIGO & CARDOSO EXTINTORES LTDA","NF",3473,1248.23,null,"bar 191118","2018-10-23",null,"25.144.267/0001-83","NOK","2018-08-03","OK","18.625.636/0001-94","47.89-0-99","Comércio varejista de outros produtos não especificados anteriormente",null,1248.23,"OK",null,"",null,null,null,null,"NOK"]
["MORADA LAR E CONSTRUCAO LTDA","NF",1761,5000,null,"bar 201118","2018-11-16",null,"25.144.267/0001-83","NOK","2018-08-03","OK","27.488.256/0001-46","47.44-0-99","Comércio varejista de materiais de construção em geral",null,5000,"OK",null,"",null,null,null,null,"NOK"]
["INDUSTRIA E COMERCIO DE TINTAS ROMA LTDA","NF",13837,33941,null,"bar 201118","2019-08-22",null,"25.144.267/0001-83","NOK","2018-08-03","OK","72.866.528/0001-59","20.71-1-00 ","Fabricação de tintas, vernizes, esmaltes e lacas",null,33941,"OK",null,"",null,null,null,null,"NOK"]
["TUDO D'AGUA MATERIAIS PARA CONSTRUCAO LTDA.","NF",111865,18765.189999999999,null,"bar 261118","2018-09-01",null,"25.144.267/0001-83","NOK","2018-08-03","OK","02.611.072/0001-09","47.44-0-99","Comércio varejista de materiais de construção em geral",null,18765.189999999999,"OK",null,"",null,null,null,null,"NOK"]
["JORDIVINO FRANCISCO VARGAS 46430580130","NF",21,8000,null,"bar 051218","2018-12-04",null,"25.144.267/0001-83","NOK","2018-08-03","OK","13.717.192/0001-01","31.01-2-00 "," Fabricação de móveis com predominância de madeira",null,8000,"OK",null,"",null,null,null,null,"NOK"]
["ELIAS GARCIA DE SOUZA 85195057168","NF",10,2770,null,"bar 061218","2018-11-29",null,"25.144.267/0001-83","NOK","2018-08-03","OK","30.815.826/0001-70","43.30-4-04","Serviços de pintura de edifícios em geral",null,2770,"OK",null,"",null,null,null,null,"NOK"]
["CAMPOS ARTIGOS DE DECORACAO LTDA","NF",270,5000,null,"bar 071218","2018-11-22",null,"25.144.267/0001-83","NOK","2018-08-03","OK","13.085.961/0001-98","47.89-0-99","Comércio varejista de outros produtos não especificados anteriormente",null,5000,"OK",null,"",null,null,null,null,"NOK"]
["JULIANE CRISTINA FONSECA 09120794959","NF",6,4500,null,"bar 071218","2018-11-28",null,"25.144.267/0001-83","NOK","2018-08-03","OK","31.938.998/0001-01","43.30-4-04","Serviços de pintura de edifícios em geral",null,4500,"OK",null,"",null,null,null,null,"NOK"]
["RAFAEL ROSA TERRAPLENAGEM","NF",171,2685,null,"bar 071218","2018-11-29",null,"25.144.267/0001-83","NOK","2018-08-03","OK","26.516.006/0001-00","43.13-4-00","Obras de terraplenagem",null,2685,"OK",null,"",null,null,null,null,"NOK"]
["GRANDMIX CONCRETO LTDA","NF",62621,3699.37,null,"bar 101218","2018-11-08",null,"25.144.267/0001-83","NOK","2018-08-03","OK","03.415.439/0002-54","42.99-5-99"," Outras obras de engenharia civil não especificadas anteriormente",null,3699.37,"OK",null,"",null,null,null,null,"NOK"]
["WGR CONSTRUTORA E INCORPORADORA - SPE 02 OLIMPIA LTDA","NF",55,6282.6,null,"bar 101218","2018-11-30",null,"25.144.267/0001-83","NOK","2018-08-03","OK","17.191.725/0001-07","41.20-4-00","Construção de edifícios",null,6282.6,"OK",null,"",null,null,null,null,"NOK"]
["FORT LUZ MATERIAIS ELETRICOS LTDA","NF",126034,1699,null,"bar 201218","2018-11-26",null,"25.144.267/0001-83","NOK","2018-08-03","OK","01.146.886/0001-49","47.42-3-00 ","Comércio varejista de material elétrico",null,1699,"OK",null,"",null,null,null,null,"NOK"]
["ANTONIO FERNANDO BARBOSA JODAS 32764753837","NF",67,2600,null,"bar 201218","2018-12-13",null,"25.144.267/0001-83","NOK","2018-08-03","OK","16.105.533/0001-78","49.30-2-02","Transporte rodoviário de carga, exceto produtos perigosos e mudanças, intermunicipal, interestadual e internacional",null,2600,"OK",null,"",null,null,null,null,"NOK"]
["MORADA LAR E CONSTRUCAO LTDA","NF",1938,5000,null,"bar 201118","2018-12-17",null,"25.144.267/0001-83","NOK","2018-08-03","OK","27.488.256/0001-46","47.44-0-99","Comércio varejista de materiais de construção em geral",null,5000,"OK",null,"",null,null,null,null,"NOK"]
["LEDZS ILUMINACAO LTDA","NF",273,4000,null,"bar 211218","2018-12-18",null,"25.144.267/0001-83","NOK","2018-08-03","OK","11.037.885/0001-10","47.42-3-00","Comércio varejista de material elétrico",null,4000,"OK",null,{"$f":"IF(S542=\"\",\"\",IF(S542=E542,\"OK\",\"NOK\"))","v":""},null,null,null,null,"NOK"]
["CONSTRUCAFEL COMERCIO DE MATERIAIS PARA CONSTRUCAO LTDA","NF",4103,2170,null,"bar 261218","2018-11-22",null,"25.144.267/0001-83","NOK","2018-08-03","OK","07.560.263/0001-02","47.44-0-02","Comércio varejista de madeira e artefatos",null,2170,"OK",null,"",null,null,null,null,"NOK"]
["MILIMETRO COMERCIO DE FERRAGENS E ACESSORIOS LTDA","NF",3153,1000.6,null,"bar 261218","2018-11-26",null,"25.144.267/0001-83","NOK","2018-08-03","OK","11.134.323/0001-94","47.44-0-01 ","Comércio varejista de ferragens e ferramentas",null,1000.6,"OK",null,"",null,null,null,null,"NOK"]
["MAURICIO DIAVEIRO CONSTANTINO","NF",16,26473.41,null,"bar 030818","2018-07-27",null,"25.144.267/0001-83","NOK",{"$f":"IF(A545=\"\",\"\",EDATE(TODAY(),-24))","v":"2018-08-03"},"NOK","13.453.658/0001-09","42.92-8-01"," Montagem de estruturas metálicas -213-5 - Empresário (Individual)",null,26473.41,{"$f":"IF(Q545=\"\",\"\",IF(Q545=D545,\"OK\",\"NOK\"))","v":"OK"},null,"",null,null,null,null,{"$f":"IF(A545=\"\",\"\",IF(V545=\"OK\",\"OK\",IF(AND(J545=\"OK\",L545=\"OK\",P545=\"OK\",R545=\"OK\"),\"OK\",\"NOK\")))","v":"NOK"}]
["GESSO NORTE LTDA","NF",156,30000,null,"bar 030818","2018-07-27",null,"25.144.267/0001-83","NOK","2018-08-03","NOK","02.084.973/0001-81","46.79-6-04","Comércio atacadista especializado de materiais de construção não especificados anteriormente",null,30000,"OK",null,"",null,null,null,null,"NOK"]
["MECASPE METALURGICA E CALDEIRARIA SAO PEDRO LTDA","NF",2166,50000,null,"bar 070818","2018-08-01",null,"25.144.267/0001-83","NOK","2018-08-03","NOK","45.674.231/0001-19","28.61-5-00 "," Fabricação de máquinas para a indústria metalúrgica, peças e acessórios, exceto máquinas-ferramenta",null,50000,"OK",null,"",null,null,null,null,"NOK"]
["ANTONIO FERNANDO BARBOSA JODAS 32764753837","NF",66,300,null,"bar 130818","2018-08-03",null,"25.144.267/0001-83","NOK","2018-08-03","OK","16.105.533/0001-78","49.30-2-02","Transporte rodoviário de carga, exceto produtos perigosos e mudanças, intermunicipal, interestadual e internacional",null,300,"OK",null,"",null,null,null,null,"NOK"]
["HIPOLITO ELETRICA COMERCIO E SERVICOS DE GUINCHO LTDA","NF",3007,350,null,"bar 170818","2018-08-02",null,"25.144.267/0001-83","NOK","2018-08-03","NOK","12.329.156/0001-08","47.42-3-00"," Comércio varejista de material elétrico",null,350,"OK",null,"",null,null,null,null,"NOK"]
["FRIGO & CARDOSO EXTINTORES LTDA","NF",3310,10000,null,"bar 210818","2018-08-13",null,"25.144.267/0001-83","NOK","2018-08-03","OK","18.625.636/0001-94","47.89-0-99","Comércio varejista de outros produtos não especificados anteriormente",null,10000,"OK",null,"",null,null,null,null,"NOK"]
["EMPORIO DO VIDRO VIDRACARIA COMERCIAL LTDA.","NF",14,15678.73,null,"bar 240818","2018-08-17",null,"25.144.267/0001-83","NOK","2018-08-03","OK","15.258.707/0001-70","47.43-1-00","Comércio varejista de vidros",null,15678.73,"OK",null,"",null,null,null,null,"NOK"]
["VOTORANTIM CIMENTOS S.A.","NF",196557,5266.8,null,"bar 240818","2018-08-03",null,"25.144.267/0001-83","NOK","2018-08-03","OK","01.637.895/0058-78","46.74-5-00","Comércio atacadista de cimento",null,5266.8,"OK",null,"",null,null,null,null,"NOK"]
["TUDO D'AGUA MATERIAIS PARA CONSTRUCAO LTDA.","NF",110484,570,null,"bar 270818","2018-07-30",null,"25.144.267/0001-83","NOK","2018-08-03","NOK","02.611.072/0001-09","47.44-0-99","Comércio varejista de materiais de construção em geral",null,570,"OK",null,"",null,null,null,null,"NOK"]
["CONSTRU RIBEIRO COMERCIO DE MATERIAIS PARA CONSTRUCAO LTDA","NF",280437,202.3,null,"bar 270818","2018-07-27",null,"25.144.267/0001-83","NOK","2018-08-03",{"$f":"IF(G554=\"\",\"\",IF(G554>=K554,\"OK\",\"NOK\"))","v":"NOK"},"55.953.582/0001-12","47.44-0-99","Comércio varejista de materiais de construção em geral",null,202.3,"OK",null,"",null,null,null,null,"NOK"]
["TUDO D'AGUA MATERIAIS PARA CONSTRUCAO LTDA.","NF",110485,2362.13,null,"bar 270818","2018-07-30",null,"25.144.267/0001-83","NOK","2018-08-03","NOK","02.611.072/0001-09","47.44-0-99","Comércio varejista de materiais de construção em geral",null,2362.13,"OK",null,"",null,null,null,null,"NOK"]
["FERREIRA & FERNANDES DOS SANTOS LTDA","NF",4549,5037.25,null,"bar 030918","2018-08-18",null,"25.144.267/0001-83",{"$f":"IF(I556=\"\",\"\",IF(OR(I556=H556,LEFT(H556,10)=LEFT(I556,10)),\"OK\",\"NOK\"))","v":"NOK"},"2018-08-03","OK","07.438.381/0001-34","47.44-0-99"," Comércio varejista de materiais de construção em geral",null,5037.25,"OK",null,"",null,null,null,null,"NOK"]
["GESSO NORTE LTDA","NF",67,20000,null,"bar 030918","2018-08-24",null,"25.144.267/0001-83","NOK","2018-08-03","OK","02.084.973/0001-81","46.79-6-04","Comércio atacadista especializado de materiais de construção não especificados anteriormente",null,20000,"OK",null,"",null,null,null,null,"NOK"]
["IMPERMAXX IMPERMEABILIZACAO - EIRELI","NF",133,22005.87,null,"bar 030918","2018-08-27",null,"25.144.267/0001-83","NOK","2018-08-03","OK","18.249.625/0001-57","41.20-4-00","Construção de edifícios",null,22005.87,"OK",null,"",null,null,null,null,"NOK"]
["AF FORTALEZA FERRO E ACO LTDA","NF",65022,5813.6,null,"bar 030918","2018-08-27",null,"25.144.267/0001-83","NOK","2018-08-03","OK","71.676.670/0001-70","47.44-0-01","Comércio varejista de ferragens e ferramentas",null,5813.6,"OK",null,"",null,null,null,null,"NOK"]
["WE CONSTRUTORA DE BARRETOS LTDA","NF",13,2494.8000000000002,null,"bar 040918","2018-08-29",null,"25.144.267/0001-83","NOK","2018-08-03","OK","18.722.339/0001-67","206-2","Sociedade Empresária Limitada",null,2494.8000000000002,"OK",null,"",null,null,null,null,"NOK"]
["GOL CACAMBA & TERRAPLENAGEM BARRETOS - EIRELI","NF",335,2116.8000000000002,null,"bar 050918","2018-08-29",null,"25.144.267/0001-83","NOK","2018-08-03","OK","14.794.870/0001-94","38.11-4-00","Coleta de resíduos não-perigosos",null,2116.8000000000002,"OK",null,"","Locação de caçambas",null,null,null,"NOK"]
["COMAP MATERIAIS PARA CONSTRUCOES LTDA","NF",41141,65.14,null,"bar 100918","2018-08-10",null,"25.144.267/0001-83","NOK","2018-08-03","OK","48.447.627/0001-11","47.44-0-05","Comércio varejista de materiais de construção não especificados anteriormente",null,65.14,"OK",null,"",null,null,null,null,"NOK"]
["NOGUEIRA & NOGUEIRA OLIMPIA LTDA","NF",23014,407.6,null,"bar 100918","2018-08-13",null,"25.144.267/0001-83","NOK","2018-08-03","OK","00.162.343/0001-52","47.41-5-00"," Comércio varejista de tintas e materiais para pintura",null,407.6,"OK",null,"",null,null,null,null,"NOK"]
["FULLMETAL INDUSTRIA E COMERCIO S/A","NF",11572,3644.8,null,"bar 100918","2018-08-02",null,"25.144.267/0001-83","NOK","2018-08-03","NOK","12.093.443/0001-53","25.42-0-00","Fabricação de artigos de serralheria, exceto esquadrias",null,3644.8,"OK",null,"",null,null,null,null,"NOK"]
["MANFRIN , CASSEB & CIA LTDA","NF",44569,1440,null,"bar 130918","2018-08-14",null,"25.144.267/0001-83","NOK","2018-08-03","OK","72.739.543/0015-31","47.41-5-00","Comércio varejista de tintas e materiais para pintura",null,1440,"OK",null,"",null,null,null,null,"NOK"]
["RINNAI BRASIL TECNOLOGIA DE AQUECIMENTO LTDA.","NF",280111,28317,null,"bar 140918","2018-08-17",null,"25.144.267/0001-83","NOK","2018-08-03","OK","47.173.950/0001-81","27.59-7-99"," Fabricação de outros aparelhos eletrodomésticos não especificados anteriormente, peças e acessórios",null,28317,"OK",null,"",null,null,null,null,"NOK"]
["CONDUMAX - ELETRO METALURGICA CIAFUNDI LTDA","NF",197860,9845.82,null,"bar 140918","2018-08-15",null,"25.144.267/0001-83","NOK","2018-08-03","OK","53.224.127/0005-84","27.33-3-00 ","Fabricação de fios, cabos e condutores elétricos isolados",null,9845.82,"OK",null,"",null,null,null,null,"NOK"]
["ROCHAFORT LOCACAO DE EQUIPAMENTOS EIRELI","NF",47496,350,null,"bar 190918","2018-08-22",null,"25.144.267/0001-83","NOK","2018-08-03","OK","12.638.310/0001-15","77.32-2-01"," Aluguel de máquinas e equipamentos para construção sem operador, exceto andaimes",null,350,"OK",null,"",null,null,null,null,"NOK"]
["VOTORANTIM CIMENTOS S.A.","NF",197987,1818.01,null,"bar 190918","2018-08-22",null,"25.144.267/0001-83","NOK","2018-08-03","OK","01.637.895/0058-78","46.74-5-00","Comércio atacadista de cimento",null,1818.01,"OK",null,"",null,null,null,null,"NOK"]
["VOTORANTIM CIMENTOS S.A.","NF",197986,1718.01,null,"bar 190918","2018-08-22",null,"25.144.267/0001-83","NOK","2018-08-03","OK","01.637.895/0058-78","46.74-5-00","Comércio atacadista de cimento",null,1718.01,"OK",null,"",null,null,null,null,"NOK"]
["DALLA COSTA & HORIQUERI SILVA LTDA","NF",7974,27,null,"bar 250918","2018-09-10",null,"25.144.267/0001-83","NOK","2018-08-03","OK","00.233.468/0001-26","47.41-5-00 ","Comércio varejista de tintas e materiais para pintura",null,27,"OK",null,"",null,null,null,null,"NOK"]
["FERREIRA AYUB COMERCIO DE MATERIAIS ELETRICOS LTDA","NF",6294,532.72,null,"bar 250918","2018-09-10",null,"25.144.267/0001-83","NOK","2018-08-03","OK","14.159.886/0001-25","47.42-3-00","Comércio varejista de material elétrico",null,532.72,"OK",null,"",null,null,null,null,"NOK"]
["TUDO D'AGUA MATERIAIS PARA CONSTRUCAO LTDA.","NF",110647,1400,null,"bar 270918","2018-08-02",null,"25.144.267/0001-83","NOK","2018-08-03","NOK","02.611.072/0001-09","47.44-0-99","Comércio varejista de materiais de construção em geral",null,1400,"OK",null,"",null,null,null,null,"NOK"]
["MANETONI DISTRIBUIDORA DE PRODUTOS SIDERURGICOS IMPORTACAO E EXPORTACAO LTDA","NF",589007,5959.7,null,"bar 270918","2018-08-28",null,"25.144.267/0001-83","NOK","2018-08-03","OK","49.795.800/0015-30","46.85-1-00"," Comércio atacadista de produtos siderúrgicos e metalúrgicos, exceto para construção",null,5959.7,"OK",null,"",null,null,null,null,"NOK"]
["DALLA COSTA & HORIQUERI SILVA LTDA","NF",7984,171,null,"bar 270918","2018-09-12",null,"25.144.267/0001-83","NOK","2018-08-03","OK","00.233.468/0001-26","47.41-5-00 ","Comércio varejista de tintas e materiais para pintura",null,171,"OK",null,"",null,null,null,null,"NOK"]
["HIPOLITO ELETRICA COMERCIO E SERVICOS DE GUINCHO LTDA","NF",3058,240,null,"bar 270918","2018-09-12",null,"25.144.267/0001-83","NOK","2018-08-03","OK","12.329.156/0001-08","47.42-3-00"," Comércio varejista de material elétrico",null,240,"OK",null,{"$f":"IF(S576=\"\",\"\",IF(S576=E576,\"OK\",\"NOK\"))","v":""},null,null,null,null,"NOK"]
["TUDO D'AGUA MATERIAIS PARA CONSTRUCAO LTDA.","NF",111158,2899.97,null,"bar 280918","2018-08-17",null,"25.144.267/0001-83","NOK","2018-08-03","OK","02.611.072/0001-09","47.44-0-99","Comércio varejista de materiais de construção em geral",null,2899.97,"OK",null,"",null,null,null,null,"NOK"]
["COMAP MATERIAIS PARA CONSTRUCOES LTDA","NF",41423,47.35,null,"bar 280918","2018-08-29",null,"25.144.267/0001-83","NOK","2018-08-03","OK","48.447.627/0001-11","47.44-0-05"," Comércio varejista de materiais de construção não especificados anteriormente",null,47.35,"OK",null,"",null,null,null,null,"NOK"]
["INDFOL INDUSTRIA E COMERCIO LTDA","NF",8595,940.8,null,"bar 280918","2018-08-31",null,"25.144.267/0001-83","NOK","2018-08-03","OK","04.348.248/0001-07","25.99-3-99"," Fabricação de outros produtos de metal não especificados anteriormente",null,940.8,"OK",null,"",null,null,null,null,"NOK"]
["CASA TOGNINI MATERIAIS HIDRAULICOS E SANITARIOS LTDA","NF",330658,5198.3599999999997,null,"bar 280918","2018-08-31",null,"25.144.267/0001-83","NOK","2018-08-03","OK","62.815.949/0001-05","46.79-6-99","Comércio atacadista de materiais de construção em geral",null,5198.3599999999997,"OK",null,"",null,null,null,null,"NOK"]
["TECNO FLUIDOS SISTEMAS DE CONDUCAO EIRELI","NF",88151,5340.44,null,"bar 280918","2018-08-31",null,"25.144.267/0001-83","NOK","2018-08-03","OK","02.990.846/0001-41","22.23-4-00"," Fabricação de tubos e acessórios de material plástico para uso na construção",null,5340.44,"OK",null,"",null,null,null,null,"NOK"]
["BENEDITO PIANTA - CIMENTOS","NF",544,2199.6,null,"bar 280918","2018-09-18",null,"25.144.267/0001-83","NOK","2018-08-03","OK","11.662.168/0001-89","23.30-3-02","Fabricação de artefatos de cimento para uso na construção",null,2199.6,"OK",null,"",null,null,null,null,"NOK"]
["TREVAO HOME CENTER LTDA","NF",92706,500,null,"bar 011018","2018-08-29",null,"25.144.267/0001-83","NOK","2018-08-03","OK","59.567.396/0001-04","47.44-0-05","Comércio varejista de materiais de construção não especificados anteriormente",null,500,"OK",null,"",null,null,null,null,"NOK"]
["ROCHAFORT LOCACAO DE EQUIPAMENTOS EIRELI","NF",47899,480,null,"bar 011018","2018-09-03",null,"25.144.267/0001-83","NOK","2018-08-03","OK","12.638.310/0001-15","77.32-2-01"," Aluguel de máquinas e equipamentos para construção sem operador, exceto andaimes",null,480,{"$f":"IF(Q584=\"\",\"\",IF(Q584=D584,\"OK\",\"NOK\"))","v":"OK"},null,"",null,null,null,null,"NOK"]
["VANGUARDA COMERCIAL HIDRO ELETRICA - EIRELI","NF",39482,3700,null,"bar 011018","2018-08-31",null,"25.144.267/0001-83","NOK",{"$f":"IF(A585=\"\",\"\",EDATE(TODAY(),-24))","v":"2018-08-03"},"OK","66.563.040/0002-30","46.73-7-00","Comércio atacadista de material elétrico",null,3700,"OK",null,"",null,null,null,null,{"$f":"IF(A585=\"\",\"\",IF(V585=\"OK\",\"OK\",IF(AND(J585=\"OK\",L585=\"OK\",P585=\"OK\",R585=\"OK\"),\"OK\",\"NOK\")))","v":"NOK"}]
["NEOTERMICA ISOLANTES TERMICOS E REVESTIMENTOS METALICOS LTDA.","NF",59009,1185.58,null,"bar 021018","2018-09-04",null,"25.144.267/0001-83","NOK","2018-08-03","OK","51.760.270/0001-31","46.89-3-99 "," Comércio atacadista especializado em outros produtos intermediários não especificados anteriormente",null,1185.58,"OK",null,"",null,null,null,null,"NOK"]
["COMAP MATERIAIS PARA CONSTRUCOES LTDA","NF",41500,60.2,null,"bar 031018","2018-09-03",null,"25.144.267/0001-83","NOK","2018-08-03","OK","48.447.627/0001-11","47.44-0-05"," Comércio varejista de materiais de construção não especificados anteriormente",null,60.2,"OK",null,"",null,null,null,null,"NOK"]
["TUDO D'AGUA MATERIAIS PARA CONSTRUCAO LTDA.","NF",112012,692.69,null,"bar 031018","2018-09-05",null,"25.144.267/0001-83","NOK","2018-08-03","OK","02.611.072/0001-09","47.44-0-99","Comércio varejista de materiais de construção em geral",null,692.69,"OK",null,"",null,null,null,null,"NOK"]
["TUDO D'AGUA MATERIAIS PARA CONSTRUCAO LTDA.","NF",112011,129.4,null,"bar 031018","2018-09-05",null,"25.144.267/0001-83","NOK","2018-08-03","OK","02.611.072/0001-09","47.44-0-99","Comércio varejista de materiais de construção em geral",null,129.4,"OK",null,"",null,null,null,null,"NOK"]
["TUDO D'AGUA MATERIAIS PARA CONSTRUCAO LTDA.","NF",112013,260.52,null,"bar 031018","2018-09-05",null,"25.144.267/0001-83","NOK","2018-08-03","OK","02.611.072/0001-09","47.44-0-99","Comércio varejista de materiais de construção em geral",null,260.52,"OK",null,"",null,null,null,null,"NOK"]
["SFERA COMERCIAL E IMPORTADORA LTDA","NF",129726,1567.28,null,"bar 041018","2018-09-04",null,"25.144.267/0001-83","NOK","2018-08-03","OK","72.741.051/0001-85","46.13-3-00","Representantes comerciais e agentes do comércio de madeira, material de construção e ferragens",null,1567.28,"OK",null,"",null,null,null,null,"NOK"]
["NORTEL SUPRIMENTOS INDUSTRIAIS LTDA","NF",846336,3270.34,null,"bar 041018","2018-09-06",null,"25.144.267/0001-83","NOK","2018-08-03","OK","46.044.053/0029-06","46.73-7-00 "," Comércio atacadista de material elétrico",null,3270.34,"OK",null,"",null,null,null,null,"NOK"]
["KRARO TINTAS BARRETOS LTDA","NF",5261,60,null,"bar 041018","2018-09-19",null,"25.144.267/0001-83","NOK","2018-08-03","OK","07.108.795/0001-03","47.41-5-00","Comércio varejista de tintas e materiais para pintura (Dispensada *)",null,60,"OK",null,"",null,null,null,null,"NOK"]
["INDUSTRIA E COMERCIO DE TINTAS ROMA LTDA","NF",13916,5640,null,"bar 081018","2018-09-06",null,"25.144.267/0001-83","NOK","2018-08-03","OK","72.866.528/0001-59","20.71-1-00 ","Fabricação de tintas, vernizes, esmaltes e lacas",null,5640,"OK",null,"",null,null,null,null,"NOK"]
["MANFRIN , CASSEB & CIA LTDA","NF",44272,2427.6,null,"bar 091018","2018-08-08",null,"25.144.267/0001-83","NOK","2018-08-03","OK","72.739.543/0015-31","47.41-5-00","Comércio varejista de tintas e materiais para pintura",null,2427.6,"OK",null,"",null,null,null,null,"NOK"]
["TUDO D'AGUA MATERIAIS PARA CONSTRUCAO LTDA.","NF",112158,225,null,"bar 091018","2018-09-11",null,"25.144.267/0001-83","NOK","2018-08-03","OK","02.611.072/0001-09","47.44-0-99","Comércio varejista de materiais de construção em geral",null,225,"OK",null,"",null,null,null,null,"NOK"]
["LIDER INDUSTRIA E COMERCIO DE EQUIPAMENTOS EIRELI","NF",11462,5902.36,null,"bar 091018","2018-09-11",null,"25.144.267/0001-83","NOK","2018-08-03","OK","45.601.127/0001-02","26.10-8-00","Fabricação de componentes eletrônicos",null,5902.36,"OK",null,"",null,null,null,null,"NOK"]
["TUDO D'AGUA MATERIAIS PARA CONSTRUCAO LTDA.","NF",112149,553.49,null,"bar 091018","2018-09-11",null,"25.144.267/0001-83","NOK","2018-08-03","OK","02.611.072/0001-09","47.44-0-99","Comércio varejista de materiais de construção em geral",null,553.49,"OK",null,"",null,null,null,null,"NOK"]
["TUDO D'AGUA MATERIAIS PARA CONSTRUCAO LTDA.","NF",112157,164,null,"bar 091018","2018-09-11",null,"25.144.267/0001-83","NOK","2018-08-03","OK","02.611.072/0001-09","47.44-0-99","Comércio varejista de materiais de construção em geral",null,164,"OK",null,"",null,null,null,null,"NOK"]
["JOSE ELIAS MORAIS","NF",2021,20000,null,"bar 101018","2018-10-03",null,"25.144.267/0001-83","NOK","2018-08-03","OK","55.580.310/0001-14","23.91-5-01","Britamento de pedras, exceto associado à extração - 213-5 - Empresário (Individual)",null,20000,"OK",null,"",null,null,null,null,"NOK"]
["CENTRO SUL INDUSTRIA E COMERCIO DE PORTAS E JANELAS LTDA.","NF",2798,49313.599999999999,null,"bar 151018","2018-08-01",null,"25.144.267/0001-83","NOK","2018-08-03","NOK","09.276.291/0001-10","25.12-8-00","Fabricação de esquadrias de metal",null,49313.599999999999,"OK",null,"",null,null,null,null,"NOK"]
["IGM PRESTACAO DE SERVICOS LTDA","NF",1280,6000,null,"bar 151018","2018-08-01",null,"25.144.267/0001-83","NOK","2018-08-03","NOK","13.482.569/0001-82","16.22-6-02","Fabricação de esquadrias de madeira e de peças de madeira para instalações industriais e comerciais",null,6000,"OK",null,"",null,null,null,null,"NOK"]
["IGM PRESTACAO DE SERVICOS LTDA","NF",1281,1788.48,null,"bar 151018","2018-08-01",null,"25.144.267/0001-83","NOK","2018-08-03","NOK","13.482.569/0001-82","16.22-6-02","Fabricação de esquadrias de madeira e de peças de madeira para instalações industriais e comerciais",null,1788.48,"OK",null,"",null,null,null,null,"NOK"]
["IGM PRESTACAO DE SERVICOS LTDA","NF",1282,8480.31,null,"bar 151018","2018-08-01",null,"25.144.267/0001-83","NOK","2018-08-03","NOK","13.482.569/0001-82","16.22-6-02","Fabricação de esquadrias de madeira e de peças de madeira para instalações industriais e comerciais",null,8480.31,"OK",null,"",null,null,null,null,"NOK"]
["TUDO D'AGUA MATERIAIS PARA CONSTRUCAO LTDA.","NF",111162,6104.78,null,"bar 151018","2018-08-18",null,"25.144.267/0001-83","NOK","2018-08-03","OK","02.611.072/0001-09","47.44-0-99","Comércio varejista de materiais de construção em geral",null,6104.78,"OK",null,"",null,null,null,null,"NOK"]
["INDUSTRIA E COMERCIO DE TINTAS ROMA LTDA","NF",13804,825,null,"bar 151018","2018-08-16",null,"25.144.267/0001-83","NOK","2018-08-03",{"$f":"IF(G606=\"\",\"\",IF(G606>=K606,\"OK\",\"NOK\"))","v":"OK"},"72.866.528/0001-59","20.71-1-00 ","Fabricação de tintas, vernizes, esmaltes e lacas",null,825,"OK",null,"",null,null,null,null,"NOK"]
["Blometal Industria e Comercio de Artefatos de Cimento LTDA","NF",3514,735,null,"bar 151018","2018-09-14",null,"25.144.267/0001-83","NOK","2018-08-03","OK","02.201.065/0001-20","23.30-3-02","Fabricação de artefatos de cimento para uso na construção",null,735,"OK",null,"",null,null,null,null,"NOK"]
["CENTRO SUL INDUSTRIA E COMERCIO DE PORTAS E JANELAS LTDA.","NF",2907,3463.42,null,"bar 151018","2018-09-28",null,"25.144.267/0001-83",{"$f":"IF(I608=\"\",\"\",IF(OR(I608=H608,LEFT(H608,10)=LEFT(I608,10)),\"OK\",\"NOK\"))","v":"NOK"},"2018-08-03","OK","09.276.291/0001-10","25.12-8-00","Fabricação de esquadrias de metal",null,3463.42,"OK",null,"",null,null,null,null,"NOK"]
["Acmav - Caldeiraria Montagens Industriais e Locacao de Guindastes LTDA","NF",1229,1760,null,"bar 151018","2018-10-03",null,"25.144.267/0001-83","NOK","2018-08-03","OK","02.245.837/0001-26","33.21-0-00"," Instalação de máquinas e equipamentos industriais",null,1760,"OK",null,"",null,null,null,null,"NOK"]
["Benitez & Ramos Comercio de Parafusos e Ferragens LTDA","NF",137992,427,null,"bar 151018","2018-10-09",null,"25.144.267/0001-83","NOK","2018-08-03","OK","01.806.196/0001-79","46.72-9-00","Comércio atacadista de ferragens e ferramentas",null,427,"OK",null,"",null,null,null,null,"NOK"]
["ROCHAFORT LOCACAO DE EQUIPAMENTOS EIRELI","NF",48517,350,null,"bar 151018","2018-09-19",null,"25.144.267/0001-83","NOK","2018-08-03","OK","12.638.310/0001-15","77.32-2-01"," Aluguel de máquinas e equipamentos para construção sem operador, exceto andaimes",null,350,"OK",null,"",null,null,null,null,"NOK"]
["COMERCIAL ESTEVES LTDA","NF",114607,540,null,"bar 171018","2018-10-02",null,"25.144.267/0001-83","NOK","2018-08-03","OK","44.790.251/0001-92","47.44-0-99","Comércio varejista de materiais de construção em geral",null,540,"OK",null,"",null,null,null,null,"NOK"]
["COMAP MATERIAIS PARA CONSTRUCOES LTDA","NF",41720,183.61,null,"bar 171018","2018-09-18",null,"25.144.267/0001-83","NOK","2018-08-03","OK","48.447.627/0001-11","47.44-0-05"," Comércio varejista de materiais de construção não especificados anteriormente",null,183.61,"OK",null,"",null,null,null,null,"NOK"]
["VOTORANTIM CIMENTOS S.A.","NF",200139,590.01,null,"bar 171018","2018-09-20",null,"25.144.267/0001-83","NOK","2018-08-03","OK","01.637.895/0058-78","46.74-5-00","Comércio atacadista de cimento",null,590.01,"OK",null,"",null,null,null,null,"NOK"]
["WE CONSTRUTORA DE BARRETOS LTDA","NF",19,8618.4,null,"bar 191018","2018-09-28",null,"25.144.267/0001-83","NOK","2018-08-03","OK","18.722.339/0001-67","206-2","Sociedade Empresária Limitada",null,8618.4,"OK",null,"",null,null,null,null,"NOK"]
["PAULO RADAMES BELCARI DE MELO","NF",38,10870.08,null,"bar 191018","2018-10-11",null,"25.144.267/0001-83","NOK","2018-08-03","OK","28.288.408/0001-20","43.30-4-04","Serviços de pintura de edifícios em geral",null,10870.08,"OK",null,"",null,null,null,null,"NOK"]
["RIO LIXAS INDUSTRIA E COMERCIO DE ABRASIVOS, IMPORTACAO E EXPORTACAO LTDA","NF",28780,450,null,"bar 191018","2018-09-20",null,"25.144.267/0001-83","NOK","2018-08-03","OK","05.529.379/0001-45","46.63-0-00 ","Comércio atacadista de Máquinas e equipamentos para uso industrial; partes e peças",null,450,"OK",null,"",null,null,null,null,"NOK"]
["FERREIRA & FERNANDES DOS SANTOS LTDA","NF",4574,5981.15,null,"bar 191018","2018-09-22",null,"25.144.267/0001-83","NOK","2018-08-03","OK","07.438.381/0001-34","47.44-0-99","Comércio varejista de materiais de construção em geral",null,5981.15,"OK",null,"",null,null,null,null,"NOK"]
["HAUS TINTAS E TEXTURAS LTDA","NF",23374,836.91,null,"bar 191018","2018-10-04",null,"25.144.267/0001-83","NOK","2018-08-03","OK","18.177.506/0001-36","20.71-1-00","Fabricação de tintas, vernizes, esmaltes e lacas",null,836.91,"OK",null,"",null,null,null,null,"NOK"]
["HAUS TINTAS E TEXTURAS LTDA","NF",23375,836.91,null,"bar 191018","2018-10-04",null,"25.144.267/0001-83","NOK","2018-08-03","OK","18.177.506/0001-36","20.71-1-00","Fabricação de tintas, vernizes, esmaltes e lacas",null,836.91,"OK",null,"",null,null,null,null,"NOK"]
["VOTORANTIM CIMENTOS S.A.","NF",200241,590.01,null,"bar 191018","2018-09-21",null,"25.144.267/0001-83","NOK","2018-08-03","OK","01.637.895/0058-78","46.74-5-00","Comércio atacadista de cimento",null,590.01,"OK",null,"",null,null,null,null,"NOK"]
["RAFAEL ROSA TERRAPLENAGEM","NF",12,2340,null,"bar 191018","2018-10-09",null,"25.144.267/0001-83","NOK","2018-08-03","OK","26.516.006/0001-00","49.30-2-01","Transporte rodoviário de carga, exceto produtos perigosos e mudanças, municipal",null,2340,"OK",null,"",null,null,null,null,"NOK"]
["SOARES CATANDUVA ALUGUEL DE EQUIPAMENTOS E MAQUINAS LTDA","NF",3623,902.66,null,"bar 241018","2018-10-24",null,"25.144.267/0001-83","NOK","2018-08-03","OK","07.209.849/0002-08","77.32-2-01","Aluguel de máquinas e equipamentos para construção sem operador, exceto andaimes",null,902.66,"OK",null,"",null,null,null,null,"NOK"]
["AGROMETAL COMERCIAL DE FERRAGENS LTDA","NF",65359,2515.54,null,"bar 291018","2018-09-28",null,"25.144.267/0001-83","NOK","2018-08-03","OK","48.539.548/0007-26","47.44-0-99","Comércio varejista de materiais de construção em geral",null,2515.54,"OK",null,"",null,null,null,null,"NOK"]
["AGROMETAL COMERCIAL DE FERRAGENS LTDA","NF",653558,116.94,null,"bar 291018","2018-09-28",null,"25.144.267/0001-83","NOK","2018-08-03","OK","48.539.548/0007-26","47.44-0-99","Comércio varejista de materiais de construção em geral",null,116.94,"OK",null,"",null,null,null,null,"NOK"]
["ROCHAFORT LOCACAO DE EQUIPAMENTOS EIRELI","NF",48894,480,null,"bar 291018","2018-10-01",null,"25.144.267/0001-83","NOK","2018-08-03","OK","12.638.310/0001-15","77.32-2-01"," Aluguel de máquinas e equipamentos para construção sem operador, exceto andaimes",null,480,"OK",null,"",null,null,null,null,"NOK"]
["SANDRO DA SILVA RODA","NF",781,560,null,"bar 040918","2018-08-29",null,"25.144.267/0001-83","NOK","2018-08-03","OK","22.129.970/0001-24","43.22-3-02","Instalação e manutenção de sistemas centrais de ar condicionado, de ventilação e refrigeração",null,null,"",null,"","Instalações de ar condicionado e higienização ",null,null,null,"NOK"]
["SANDRO DA SILVA RODA","NF",801,80,null,"bar 040918","2018-08-31",null,"25.144.267/0001-83","NOK","2018-08-03","OK","22.129.970/0001-24","43.22-3-02","Instalação e manutenção de sistemas centrais de ar condicionado, de ventilação e refrigeração",null,null,"",null,"","Instalações de ar condicionado e higienização ",null,null,null,"NOK"]
["SANDRO DA SILVA RODA","NF",871,1400,null,"bar16112018","2018-11-08",null,"25.144.267/0001-83","NOK","2018-08-03","OK","22.129.970/0001-24","43.22-3-02","Instalação e manutenção de sistemas centrais de ar condicionado, de ventilação e refrigeração",null,null,"",null,"","Instalações de ar condicionado e higienização ",null,null,null,"NOK"]
["FERRARE ASSESSORIA LTDA","NF",126,13000,null,"bar 130818","2018-08-01",null,"25.144.267/0001-83","NOK","2018-08-03","NOK","16.688.405/0001-02","43.11-8-01 ","Demolição de edifícios e outras estruturas",null,null,"",null,"",null,null,null,null,{"$f":"IF(#REF!=\"\",\"\",IF(V630=\"OK\",\"OK\",IF(AND(J630=\"OK\",L630=\"OK\",P630=\"OK\",R630=\"OK\"),\"OK\",\"NOK\")))","v":{"$error":"#REF!"}}]
["FERRARE ASSESSORIA LTDA","NF",131,2469.8000000000002,null,"bar 040918","2018-08-29",null,"25.144.267/0001-83","NOK","2018-08-03","OK","18.722.339/0001-67","Está oculto na receita","Está oculto na receita",null,null,"",null,{"$f":"IF(S631=\"\",\"\",IF(S631=E631,\"OK\",\"NOK\"))","v":""},null,null,null,null,"NOK"]
["FERRARE ASSESSORIA LTDA","NF",130,13000,null,"bar 120918","2018-09-03",null,"25.144.267/0001-83","NOK",{"$f":"IF(A632=\"\",\"\",EDATE(TODAY(),-24))","v":"2018-08-03"},{"$f":"IF(G632=\"\",\"\",IF(G632>=K632,\"OK\",\"NOK\"))","v":"OK"},"16.688.405/0001-02","43.11-8-01 ","Demolição de edifícios e outras estruturas",null,null,"",null,"",null,null,null,null,"NOK"]
["FERNANDO CORREIA DA CRUZ","NF",337,5000,null,"bar 081018","2018-09-29",null,"25.144.267/0001-83","NOK","2018-08-03","OK","17.097.475/0001-40","95.29-1-99 ","Reparação e manutenção de outros objetos e equipamentos pessoais e domésticos não especificados anteriormente",null,null,"",null,"","Serviço de montagem de imóveis ",null,null,null,"NOK"]
["GRANDMIX CONCRETO LTDA","NF",59731,7457.94,null,"bar 151018","2018-09-14",null,"25.144.267/0001-83","NOK","2018-08-03","OK","03.415.439/0002-54","42.99-5-99"," Outras obras de engenharia civil não especificadas anteriormente",null,null,"",null,"",null,null,null,null,"NOK"]
["FERRARE ASSESSORIA LTDA","NF",132,13000,null,"bar 151018","2018-10-01",null,"25.144.267/0001-83",{"$f":"IF(I635=\"\",\"\",IF(OR(I635=H635,LEFT(H635,10)=LEFT(I635,10)),\"OK\",\"NOK\"))","v":"NOK"},{"$f":"IF(A635=\"\",\"\",EDATE(TODAY(),-24))","v":"2018-08-03"},{"$f":"IF(G635=\"\",\"\",IF(G635>=K635,\"OK\",\"NOK\"))","v":"OK"},"03.415.439/0002-54","42.99-5-99"," Outras obras de engenharia civil não especificadas anteriormente",null,null,"",null,"",null,null,null,null,"NOK"]
["FERNANDO CORREIA DA CRUZ","NF",338,20000,null,"bar 171018","2018-10-06",null,"25.144.267/0001-83",{"$f":"IF(I636=\"\",\"\",IF(OR(I636=H636,LEFT(H636,10)=LEFT(I636,10)),\"OK\",\"NOK\"))","v":"NOK"},{"$f":"IF(A636=\"\",\"\",EDATE(TODAY(),-24))","v":"2018-08-03"},{"$f":"IF(G636=\"\",\"\",IF(G636>=K636,\"OK\",\"NOK\"))","v":"OK"},"17.097.475/0001-40","95.29-1-99 ","Reparação e manutenção de outros objetos e equipamentos pessoais e domésticos não especificados anteriormente",null,null,"",null,"",null,null,null,null,"NOK"]
["BENEDITO JOSE AISSA CALHAS","NF",98,3500,null,"bar 241018","2018-10-19",null,"25.144.267/0001-83","NOK","2018-08-03","OK","08.375.783/0001-08","43.99-1-99"," Serviços especializados para construção não especificados anteriormente",null,null,"",null,"",null,null,null,null,"NOK"]
["CONSTRULOG BARRETOS LTDA","NF",630,1050,null,"bar 051118 part 2","2018-11-05",null,"25.144.267/0001-83","NOK","2018-08-03","OK","20.523.240/0001-88","77.39-0-99","Aluguel de outras máquinas e equipamentos comerciais e industriais não especificados anteriormente, sem operador",null,null,"",null,"",null,null,null,null,"NOK"]
["R. L. P. MILANES","NF",2134,31882.79,null,"bar 051218","2018-11-30",null,"25.144.267/0001-83","NOK","2018-08-03","OK","15.136.730/0001-91","47.42-3-00","Comércio varejista de material elétrico",null,null,"",null,"",null,null,null,null,"NOK"]
["REFRIGERACAO DUFRIO COMERCIO E IMPORTACAO LTDA","NF",251133,143690.81,null,"bar 071218","2018-10-12",null,"25.144.267/0001-83","NOK","2018-08-03","OK","01.754.239/0018-68","47.44-0-99 ","Comércio varejista de materiais de construção em geral",null,null,{"$f":"IF(Q640=\"\",\"\",IF(Q640=D640,\"OK\",\"NOK\"))","v":""},null,"","Ar condicionado ",null,null,null,"NOK"]
["INDUSTRIA E COMERCIO DE TINTAS ROMA LTDA","NF",13775,7965,null,"bar 071218","2018-08-09",null,"25.144.267/0001-83","NOK","2018-08-03","OK","72.866.528/0001-59","20.71-1-00 ","Fabricação de tintas, vernizes, esmaltes e lacas",null,null,"",null,"",null,null,null,null,{"$f":"IF(A641=\"\",\"\",IF(V641=\"OK\",\"OK\",IF(AND(J641=\"OK\",L641=\"OK\",P641=\"OK\",R641=\"OK\"),\"OK\",\"NOK\")))","v":"NOK"}]
["GOL CACAMBA & TERRAPLENAGEM BARRETOS - EIRELI","NF",3921,3351.6,null,"bar 071218","2018-11-27",null,"25.144.267/0001-83",{"$f":"IF(I642=\"\",\"\",IF(OR(I642=H642,LEFT(H642,10)=LEFT(I642,10)),\"OK\",\"NOK\"))","v":"NOK"},{"$f":"IF(A642=\"\",\"\",EDATE(TODAY(),-24))","v":"2018-08-03"},{"$f":"IF(G642=\"\",\"\",IF(G642>=K642,\"OK\",\"NOK\"))","v":"OK"},"14.794.870/0001-94","38.11-4-00","Coleta de resíduos não-perigosos",null,null,"",null,"","Locação de caçambas",null,null,null,"NOK"]
["FERRARE ASSESSORIA LTDA","NF",139,13000,null,"bar 101218","2018-12-03",null,"25.144.267/0001-83",{"$f":"IF(I643=\"\",\"\",IF(OR(I643=H643,LEFT(H643,10)=LEFT(I643,10)),\"OK\",\"NOK\"))","v":"NOK"},{"$f":"IF(A643=\"\",\"\",EDATE(TODAY(),-24))","v":"2018-08-03"},{"$f":"IF(G643=\"\",\"\",IF(G643>=K643,\"OK\",\"NOK\"))","v":"OK"},"16.688.405/0001-02","43.11-8-01 ","Demolição de edifícios e outras estruturas",null,null,"",null,"",null,null,null,null,"NOK"]
["EMPORIO DO VIDRO VIDRACARIA COMERCIAL LTDA.","NF",16,22000,null,"bar 171218","2018-12-07",null,"25.144.267/0001-83",{"$f":"IF(I644=\"\",\"\",IF(OR(I644=H644,LEFT(H644,10)=LEFT(I644,10)),\"OK\",\"NOK\"))","v":"NOK"},{"$f":"IF(A644=\"\",\"\",EDATE(TODAY(),-24))","v":"2018-08-03"},{"$f":"IF(G644=\"\",\"\",IF(G644>=K644,\"OK\",\"NOK\"))","v":"OK"},"15.258.707/0001-70","47.43-1-00","Comércio varejista de vidros",null,null,"",null,"",null,null,null,null,"NOK"]
["OFFICE DECOR MOVEIS EIRELI","NF",139,10700,null,"bar 181218","2018-12-12",null,"25.144.267/0001-83","NOK",{"$f":"IF(A645=\"\",\"\",EDATE(TODAY(),-24))","v":"2018-08-03"},"OK","03.104.885/0001-67","31.01-2-00","Fabricação de móveis com predominância de madeira",null,null,"",null,"",null,null,null,null,"NOK"]
["FERNANDO CORREIA DA CRUZ","NF",353,4500,null,"bar 181218","2018-12-11",null,"25.144.267/0001-83","NOK","2018-08-03","OK","17.097.475/0001-40","95.29-1-99 ","Reparação e manutenção de outros objetos e equipamentos pessoais e domésticos não especificados anteriormente",null,null,"",null,"",null,null,null,null,"NOK"]
["GESSO NORTE LTDA","NF",180,30000,null,"bar 260619","2019-06-10",null,"25.144.267/0001-83","NOK","2018-08-03","OK","02.084.973/0001-81","46.79-6-04","Comércio atacadista especializado de materiais de construção não especificados anteriormente",null,null,"",null,"",null,null,null,null,"NOK"]
["TULIO BERTONCELLO MONTEIRO","NF",308,3923.57,null,"bar 280619","2019-06-19",null,"25.144.267/0001-83","NOK","2018-08-03","OK","24.139.672/0001-40","43.22-3-02 ","Instalação e manutenção de sistemas centrais de ar condicionado, de ventilação e refrigeração",null,null,"",null,"","Instalação de ar condicionado e manutneçlão ",null,null,null,"NOK"]
["TULIO BERTONCELLO MONTEIRO","NF",307,"4,370,00",null,"bar 280619","2019-06-19",null,"25.144.267/0001-83",{"$f":"IF(I649=\"\",\"\",IF(OR(I649=H649,LEFT(H649,10)=LEFT(I649,10)),\"OK\",\"NOK\"))","v":"NOK"},{"$f":"IF(A649=\"\",\"\",EDATE(TODAY(),-24))","v":"2018-08-03"},{"$f":"IF(G649=\"\",\"\",IF(G649>=K649,\"OK\",\"NOK\"))","v":"OK"},"24.139.672/0001-40","43.22-3-02 ","Instalação e manutenção de sistemas centrais de ar condicionado, de ventilação e refrigeração",null,null,"",null,"","Instalação de ar condicionado e manutneçlão ",null,null,null,"NOK"]
["TULIO BERTONCELLO MONTEIRO","NF",320,1681.54,null,"bar 150719","2019-07-04",null,"25.144.267/0001-83",{"$f":"IF(I650=\"\",\"\",IF(OR(I650=H650,LEFT(H650,10)=LEFT(I650,10)),\"OK\",\"NOK\"))","v":"NOK"},{"$f":"IF(A650=\"\",\"\",EDATE(TODAY(),-24))","v":"2018-08-03"},{"$f":"IF(G650=\"\",\"\",IF(G650>=K650,\"OK\",\"NOK\"))","v":"OK"},"24.139.672/0001-40","43.22-3-02 ","Instalação e manutenção de sistemas centrais de ar condicionado, de ventilação e refrigeração",null,null,"",null,"",null,null,null,null,"NOK"]
["HERVAL INDUSTRIA DE MOVEIS, COLCHOES E ESPUMAS LTDA.","NF",731195,5550.01,null,"bar 020919","2019-05-03",null,"25.144.267/0001-83","NOK","2018-08-03","OK","16.670.753/0001-44","31.01-2-00 ","Fabricação de móveis com predominância de madeira","OK",5550.01,"OK",null,"","Colchão Mola",null,null,null,"NOK"]
["REFRIGERACAO DUFRIO COMERCIO E IMPORTACAO LTDA","NF",412382,11313.5,null,"bar 010819","2019-04-30",null,"25.144.267/0001-83","NOK","2018-08-03","OK","01.754.239/0018-68","47.44-0-99 ","Comércio varejista de materiais de construção em geral",null,null,"",null,"","Ar condicionado ",null,null,null,"NOK"]
["REFRIGERACAO DUFRIO COMERCIO E IMPORTACAO LTDA","NF",407511,11980,null,"bar 010819","2019-04-14",null,"25.144.267/0001-83",{"$f":"IF(I653=\"\",\"\",IF(OR(I653=H653,LEFT(H653,10)=LEFT(I653,10)),\"OK\",\"NOK\"))","v":"NOK"},{"$f":"IF(A653=\"\",\"\",EDATE(TODAY(),-24))","v":"2018-08-03"},{"$f":"IF(G653=\"\",\"\",IF(G653>=K653,\"OK\",\"NOK\"))","v":"OK"},"01.754.239/0018-68","47.44-0-99 ","Comércio varejista de materiais de construção em geral",null,null,"",null,"","Ar condicionado ",null,null,null,"NOK"]
["CALIXTO SERVICOS EM GESSO EIRELI","NF",6,3000,null,"-","2019-10-11",null,"25.144.267/0001-83","NOK","2018-08-03","OK","34.783.442/0001-73","43.30-4-03","Obras de acabamento em gesso e estuque",null,null,"",null,"",null,null,null,null,"NOK"]
["CALIXTO SERVICOS EM GESSO EIRELI","NF",4,10000,null,"-","2019-10-11",null,"25.144.267/0001-83","NOK","2018-08-03","OK","34.783.442/0001-73","43.30-4-03","Obras de acabamento em gesso e estuque",null,null,"",null,"",null,null,null,null,"NOK"]
["CALIXTO SERVICOS EM GESSO EIRELI","NF",16,33682.94,null,"-","2019-12-02",null,"25.144.267/0001-83","NOK","2018-08-03","OK","34.783.442/0001-73","43.30-4-03","Obras de acabamento em gesso e estuque",null,null,"",null,"",null,null,null,null,"NOK"]
["CALIXTO SERVICOS EM GESSO EIRELI","NF",13,13494.56,null,"-","2019-11-18",null,"25.144.267/0001-83","NOK","2018-08-03","OK","34.783.442/0001-73","43.30-4-03","Obras de acabamento em gesso e estuque",null,null,"",null,"",null,null,null,null,"NOK"]
["REFRIGERACAO DUFRIO COMERCIO E IMPORTACAO LTDA","NF",424923,5656.75,null,"-","2019-05-14",null,"25.144.267/0001-83",{"$f":"IF(I658=\"\",\"\",IF(OR(I658=H658,LEFT(H658,10)=LEFT(I658,10)),\"OK\",\"NOK\"))","v":"NOK"},{"$f":"IF(A658=\"\",\"\",EDATE(TODAY(),-24))","v":"2018-08-03"},{"$f":"IF(G658=\"\",\"\",IF(G658>=K658,\"OK\",\"NOK\"))","v":"OK"},"01.754.239/0018-68","47.44-0-99 ","Comércio varejista de materiais de construção em geral",null,null,"",null,"",null,null,null,null,"NOK"]
["ARTIMAGE INDUSTRIA E COMERCIO EIRELI","NF",58577,12672.2,null,"-","2018-10-09",null,"25.144.267/0001-83","NOK","2018-08-03","OK","68.414.150/0001-85","16.29-3-01 "," Fabricação de artefatos diversos de madeira, exceto móveis",null,null,"",null,"",null,null,null,null,"NOK"]
["VOTORANTIM CIMENTOS S.A.","NF",241977,4930.8,null,"-","2020-02-06",null,"25.144.267/0001-83",{"$f":"IF(I660=\"\",\"\",IF(OR(I660=H660,LEFT(H660,10)=LEFT(I660,10)),\"OK\",\"NOK\"))","v":"NOK"},"2018-08-03",{"$f":"IF(G660=\"\",\"\",IF(G660>=K660,\"OK\",\"NOK\"))","v":"OK"},"01.637.895/0058-78","46.74-5-00","Comércio atacadista de cimento",null,null,"",null,"",null,null,null,null,"NOK"]
["VOTORANTIM CIMENTOS S.A.","NF",237431,4947.6000000000004,null,"-","2019-12-02",null,"25.144.267/0001-83",{"$f":"IF(I661=\"\",\"\",IF(OR(I661=H661,LEFT(H661,10)=LEFT(I661,10)),\"OK\",\"NOK\"))","v":"NOK"},{"$f":"IF(A661=\"\",\"\",EDATE(TODAY(),-24))","v":"2018-08-03"},{"$f":"IF(G661=\"\",\"\",IF(G661>=K661,\"OK\",\"NOK\"))","v":"OK"},"01.637.895/0058-78","46.74-5-00","Comércio atacadista de cimento",null,null,"",null,"",null,null,null,null,"NOK"]
["VOTORANTIM CIMENTOS S.A.","NF",235734,3754.01,null,"-","2019-11-08",null,"25.144.267/0001-83",{"$f":"IF(I662=\"\",\"\",IF(OR(I662=H662,LEFT(H662,10)=LEFT(I662,10)),\"OK\",\"NOK\"))","v":"NOK"},{"$f":"IF(A662=\"\",\"\",EDATE(TODAY(),-24))","v":"2018-08-03"},{"$f":"IF(G662=\"\",\"\",IF(G662>=K662,\"OK\",\"NOK\"))","v":"OK"},"01.637.895/0058-78","46.74-5-00","Comércio atacadista de cimento",null,null,"",null,"",null,null,null,null,"NOK"]
["VOTORANTIM CIMENTOS S.A.","NF",236723,5504.6,null,"-","2019-11-22",null,"25.144.267/0001-83",{"$f":"IF(I663=\"\",\"\",IF(OR(I663=H663,LEFT(H663,10)=LEFT(I663,10)),\"OK\",\"NOK\"))","v":"NOK"},{"$f":"IF(A663=\"\",\"\",EDATE(TODAY(),-24))","v":"2018-08-03"},{"$f":"IF(G663=\"\",\"\",IF(G663>=K663,\"OK\",\"NOK\"))","v":"OK"},"01.637.895/0058-78","46.74-5-00","Comércio atacadista de cimento",null,null,"",null,"",null,null,null,null,"NOK"]
["MPLAN INDUSTRIA E COMERCIO DE EQUIPAMENTOS PARA CONSTRUCAO LTDA","NF",6149,2013,null,"-","2019-03-15",null,"25.144.267/0001-83",{"$f":"IF(I664=\"\",\"\",IF(OR(I664=H664,LEFT(H664,10)=LEFT(I664,10)),\"OK\",\"NOK\"))","v":"NOK"},"2018-08-03",{"$f":"IF(G664=\"\",\"\",IF(G664>=K664,\"OK\",\"NOK\"))","v":"OK"},"06.959.527/0001-24","28.54-2-00","Fabricação de máquinas e equipamentos para terraplenagem, pavimentação e construção, peças e acessórios, exceto tratores",null,null,"",null,"",null,null,null,null,"NOK"]
["M. MOLETA COMPENSADOS - EIRELI","NF",1638,5372,null,"-","2019-03-01",null,"25.144.267/0001-83","NOK","2018-08-03","OK","18.938.544/0001-64","16.21-8-00","Fabricação de madeira laminada e de chapas de madeira compensada, prensada e aglomerada",null,null,"",null,"",null,null,null,null,"NOK"]
["FERREIRA & FERNANDES DOS SANTOS LTDA","NF",4726,3701.25,null,"-","2019-03-12",null,"25.144.267/0001-83","NOK","2018-08-03","OK","07.438.381/0001-34","47.44-0-99","Comércio varejista de materiais de construção em geral",null,null,"",null,"",null,null,null,null,"NOK"]
["MORADA LAR E CONSTRUCAO LTDA","NF",2434,2916.67,null,"barretos_22042019","2019-04-16",null,"25.144.267/0001-83","NOK","2018-08-03","OK","27.488.256/0001-46","47.44-0-99","Comércio varejista de materiais de construção em geral",null,null,"",null,"",null,null,null,null,"NOK"]
["TERRENO MUMORI","Matrícula 72.141/72.142",null,5950000,null,null,"2019-07-07",null,"25.144.267/0001-83","NOK","2018-08-03","OK",null,"",null,null,null,"",null,"",null,null,null,null,"NOK"]
[null,null,null,null,null,null,null,null,"25.144.267/0001-83","NOK","","",null,"",null,null,null,"",null,"",null,null,null,null,""]
[null,null,null,null,null,null,null,null,"25.144.267/0001-83","NOK","","",null,"",null,null,null,"",null,"",null,null,null,null,""]
[null,null,null,null,null,null,null,null,"25.144.267/0001-83","NOK","","",null,"",null,null,null,"",null,"",null,null,null,null,""]
[null,null,null,null,null,null,null,null,"25.144.267/0001-83","NOK","","",null,"",null,null,null,"",null,"",null,null,null,null,""]
[null,null,null,null,null,null,null,null,"25.144.267/0001-83","NOK","","",null,"",null,null,null,"",null,"",null,null,null,null,""]
[null,null,null,null,null,null,null,null,"25.144.267/0001-83","NOK","","",null,"",null,null,null,"",null,"",null,null,null,null,""]
[null,null,null,null,null,null,null,null,"25.144.267/0001-83","NOK","","",null,"",null,null,null,"",null,"",null,null,null,null,""]
[null,null,null,null,null,null,null,null,"25.144.267/0001-83","NOK","","",null,"",null,null,null,"",null,"",null,null,null,null,""]
[null,null,null,null,null,null,null,null,"25.144.267/0001-83","NOK","","",null,"",null,null,null,"",null,"",null,null,null,null,""]
[null,null,null,null,null,null,null,null,"25.144.267/0001-83","NOK","","",null,"",null,null,null,"",null,"",null,null,null,null,""]
[null,null,null,null,null,null,null,null,"25.144.267/0001-83","NOK","","",null,"",null,null,null,"",null,"",null,null,null,null,""]
[null,null,null,null,null,null,null,null,"25.144.267/0001-83","NOK","","",null,"",null,null,null,"",null,"",null,null,null,null,""]
[null,null,null,null,null,null,null,null,"25.144.267/0001-83","NOK","","",null,"",null,null,null,"",null,"",null,null,null,null,""]
[null,null,null,null,null,null,null,null,"25.144.267/0001-83","NOK","","",null,"",null,null,null,"",null,"",null,null,null,null,""]
[null,null,null,null,null,null,null,null,"25.144.267/0001-83","NOK","","",null,"",null,null,null,"",null,"",null,null,null,null,""]
[null,null,null,null,null,null,null,null,"25.144.267/0001-83","NOK","","",null,"",null,null,null,"",null,"",null,null,null,null,""]
[null,null,null,null,null,null,null,null,"25.144.267/0001-83","NOK","","",null,"",null,null,null,"",null,"",null,null,null,null,""]
[null,null,null,null,null,null,null,null,"25.144.267/0001-83","NOK","","",null,"",null,null,null,"",null,"",null,null,null,null,""]
[null,null,null,null,null,null,null,null,"25.144.267/0001-83","NOK","","",null,"",null,null,null,"",null,"",null,null,null,null,""]
[null,null,null,null,null,null,null,null,"25.144.267/0001-83","NOK","","",null,"",null,null,null,"",null,"",null,null,null,null,""]
[null,null,null,null,null,null,null,null,"25.144.267/0001-83","NOK","","",null,"",null,null,null,"",null,{"$f":"IF(S689=\"\",\"\",IF(S689=E689,\"OK\",\"NOK\"))","v":""},null,null,null,null,""]
[null,null,null,null,null,null,null,null,"25.144.267/0001-83","NOK","","",null,"",null,null,null,"",null,"",null,null,null,null,""]
[null,null,null,null,null,null,null,null,"25.144.267/0001-83","NOK","","",null,"",null,null,null,"",null,"",null,null,null,null,""]
[null,null,null,null,null,null,null,null,"25.144.267/0001-83","NOK","","",null,"",null,null,null,"",null,"",null,null,null,null,""]
[null,null,null,null,null,null,null,null,"25.144.267/0001-83","NOK","","",null,"",null,null,null,"",null,"",null,null,null,null,""]
[null,null,null,null,null,null,null,null,"25.144.267/0001-83","NOK","","",null,"",null,null,null,"",null,"",null,null,null,null,""]
[null,null,null,null,null,null,null,null,"25.144.267/0001-83","NOK","","",null,"",null,null,null,"",null,"",null,null,null,null,""]
[null,null,null,null,null,null,null,null,"25.144.267/0001-83","NOK","","",null,"",null,null,null,"",null,"",null,null,null,null,""]
[null,null,null,null,null,null,null,null,"25.144.267/0001-83","NOK","","",null,"",null,null,null,"",null,"",null,null,null,null,""]
[null,null,null,null,null,null,null,null,"25.144.267/0001-83","NOK","","",null,"",null,null,null,"",null,"",null,null,null,null,""]
[null,null,null,null,null,null,null,null,"25.144.267/0001-83","NOK","","",null,"",null,null,null,{"$f":"IF(Q699=\"\",\"\",IF(Q699=D699,\"OK\",\"NOK\"))","v":""},null,"",null,null,null,null,""]
[null,null,null,null,null,null,null,null,"25.144.267/0001-83","NOK","","",null,"",null,null,null,"",null,"",null,null,null,null,{"$f":"IF(A700=\"\",\"\",IF(V700=\"OK\",\"OK\",IF(AND(J700=\"OK\",L700=\"OK\",P700=\"OK\",R700=\"OK\"),\"OK\",\"NOK\")))","v":""}]
[null,null,null,null,null,null,null,null,"25.144.267/0001-83","NOK","","",null,"",null,null,null,"",null,"",null,null,null,null,""]
[null,null,null,null,null,null,null,null,"25.144.267/0001-83","NOK","","",null,"",null,null,null,"",null,"",null,null,null,null,""]
[null,null,null,null,null,null,null,null,"25.144.267/0001-83","NOK",{"$f":"IF(A703=\"\",\"\",EDATE(TODAY(),-24))","v":""},"",null,"",null,null,null,"",null,"",null,null,null,null,""]
[null,null,null,null,null,null,null,null,"25.144.267/0001-83","NOK","","",null,"",null,null,null,"",null,"",null,null,null,null,""]
[null,null,null,null,null,null,null,null,"25.144.267/0001-83","NOK","","",null,"",null,null,null,"",null,"",null,null,null,null,""]
[null,null,null,null,null,null,null,null,"25.144.267/0001-83","NOK","","",null,"",null,null,null,"",null,"",null,null,null,null,""]
[null,null,null,null,null,null,null,null,"25.144.267/0001-83","NOK","","",null,"",null,null,null,"",null,"",null,null,null,null,""]
[null,null,null,null,null,null,null,null,"25.144.267/0001-83","NOK","","",null,"",null,null,null,"",null,"",null,null,null,null,""]
[null,null,null,null,null,null,null,null,"25.144.267/0001-83","NOK","","",null,"",null,null,null,"",null,"",null,null,null,null,""]
[null,null,null,null,null,null,null,null,"25.144.267/0001-83","NOK","","",null,"",null,null,null,"",null,"",null,null,null,null,""]
[null,null,null,null,null,null,null,null,"25.144.267/0001-83","NOK","","",null,"",null,null,null,"",null,"",null,null,null,null,""]
[null,null,null,null,null,null,null,null,"25.144.267/0001-83","NOK","","",null,"",null,null,null,"",null,"",null,null,null,null,""]
[null,null,null,null,null,null,null,null,"25.144.267/0001-83","NOK","","",null,"",null,null,null,"",null,"",null,null,null,null,""]
[null,null,null,null,null,null,null,null,"25.144.267/0001-83","NOK","","",null,"",null,null,null,"",null,"",null,null,null,null,""]
[null,null,null,null,null,null,null,null,"25.144.267/0001-83","NOK","","",null,"",null,null,null,"",null,"",null,null,null,null,""]
[null,null,null,null,null,null,null,null,"25.144.267/0001-83","NOK","","",null,"",null,null,null,"",null,"",null,null,null,null,""]
[null,null,null,null,null,null,null,null,"25.144.267/0001-83","NOK","","",null,"",null,null,null,"",null,"",null,null,null,null,""]
[null,null,null,null,null,null,null,null,"25.144.267/0001-83","NOK","","",null,"",null,null,null,"",null,"",null,null,null,null,""]
[null,null,null,null,null,null,null,null,"25.144.267/0001-83","NOK","","",null,"",null,null,null,"",null,"",null,null,null,null,""]
[null,null,null,null,null,null,null,null,"25.144.267/0001-83","NOK","","",null,"",null,null,null,"",null,"",null,null,null,null,""]
[null,null,null,null,null,null,null,null,"25.144.267/0001-83","NOK","","",null,"",null,null,null,"",null,"",null,null,null,null,""]
[null,null,null,null,null,null,null,null,"25.144.267/0001-83","NOK","",{"$f":"IF(G722=\"\",\"\",IF(G722>=K722,\"OK\",\"NOK\"))","v":""},null,"",null,null,null,"",null,"",null,null,null,null,""]
[null,null,null,null,null,null,null,null,"25.144.267/0001-83","NOK","","",null,"",null,null,null,"",null,"",null,null,null,null,""]
[null,null,null,null,null,null,null,null,"25.144.267/0001-83",{"$f":"IF(I724=\"\",\"\",IF(OR(I724=H724,LEFT(H724,10)=LEFT(I724,10)),\"OK\",\"NOK\"))","v":"NOK"},"","",null,"",null,null,null,"",null,"",null,null,null,null,""]
[null,null,null,null,null,null,null,null,"25.144.267/0001-83","NOK","","",null,"",null,null,null,"",null,"",null,null,null,null,""]
[null,null,null,null,null,null,null,null,"25.144.267/0001-83","NOK","","",null,"",null,null,null,"",null,"",null,null,null,null,""]
[null,null,null,null,null,null,null,null,"25.144.267/0001-83","NOK","","",null,"",null,null,null,"",null,"",null,null,null,null,""]
[null,null,null,null,null,null,null,null,"25.144.267/0001-83","NOK","","",null,"",null,null,null,"",null,"",null,null,null,null,""]
[null,null,null,null,null,null,null,null,"25.144.267/0001-83","NOK","","",null,"",null,null,null,"",null,"",null,null,null,null,""]
[null,null,null,null,null,null,null,null,"25.144.267/0001-83","NOK","","",null,"",null,null,null,"",null,"",null,null,null,null,""]
[null,null,null,null,null,null,null,null,"25.144.267/0001-83","NOK","","",null,"",null,null,null,"",null,"",null,null,null,null,""]
[null,null,null,null,null,null,null,null,"25.144.267/0001-83","NOK","","",null,"",null,null,null,"",null,"",null,null,null,null,""]
[null,null,null,null,null,null,null,null,"25.144.267/0001-83","NOK","","",null,"",null,null,null,"",null,"",null,null,null,null,""]
[null,null,null,null,null,null,null,null,"25.144.267/0001-83","NOK","","",null,"",null,null,null,"",null,"",null,null,null,null,""]
[null,null,null,null,null,null,null,null,"25.144.267/0001-83","NOK","","",null,"",null,null,null,"",null,"",null,null,null,null,""]
[null,null,null,null,null,null,null,null,"25.144.267/0001-83","NOK","","",null,"",null,null,null,"",null,"",null,null,null,null,""]
[null,null,null,null,null,null,null,null,"25.144.267/0001-83","NOK","","",null,"",null,null,null,"",null,"",null,null,null,null,""]
[null,null,null,null,null,null,null,null,"25.144.267/0001-83","NOK","","",null,"",null,null,null,"",null,"",null,null,null,null,""]
[null,null,null,null,null,null,null,null,"25.144.267/0001-83","NOK","","",null,"",null,null,null,"",null,"",null,null,null,null,""]
[null,null,null,null,null,null,null,null,"25.144.267/0001-83","NOK","","",null,"",null,null,null,"",null,"",null,null,null,null,""]
[null,null,null,null,null,null,null,null,"25.144.267/0001-83","NOK","","",null,"",null,null,null,"",null,"",null,null,null,null,""]
[null,null,null,null,null,null,null,null,"25.144.267/0001-83","NOK","","",null,"",null,null,null,"",null,"",null,null,null,null,""]
[null,null,null,null,null,null,null,null,"25.144.267/0001-83","NOK","","",null,"",null,null,null,"",null,"",null,null,null,null,""]
[null,null,null,null,null,null,null,null,"25.144.267/0001-83","NOK","","",null,"",null,null,null,"",null,"",null,null,null,null,""]
[null,null,null,null,null,null,null,null,"25.144.267/0001-83","NOK","","",null,"",null,null,null,"",null,"",null,null,null,null,""]
[null,null,null,null,null,null,null,null,"25.144.267/0001-83","NOK","","",null,"",null,null,null,"",null,"",null,null,null,null,""]
[null,null,null,null,null,null,null,null,"25.144.267/0001-83","NOK","","",null,"",null,null,null,"",null,"",null,null,null,null,""]
[null,null,null,null,null,null,null,null,"25.144.267/0001-83","NOK","","",null,"",null,null,null,"",null,"",null,null,null,null,""]
[null,null,null,null,null,null,null,null,"25.144.267/0001-83","NOK","","",null,"",null,null,null,"",null,"",null,null,null,null,""]
[null,null,null,null,null,null,null,null,"25.144.267/0001-83","NOK","","",null,"",null,null,null,"",null,"",null,null,null,null,""]
[null,null,null,null,null,null,null,null,"25.144.267/0001-83","NOK","","",null,"",null,null,null,"",null,"",null,null,null,null,""]
[null,null,null,null,null,null,null,null,"25.144.267/0001-83","NOK","","",null,"",null,null,null,"",null,"",null,null,null,null,""]
[null,null,null,null,null,null,null,null,"25.144.267/0001-83","NOK","","",null,"",null,null,null,"",null,{"$f":"IF(S753=\"\",\"\",IF(S753=E753,\"OK\",\"NOK\"))","v":""},null,null,null,null,""]
[null,null,null,null,null,null,null,null,"25.144.267/0001-83","NOK","","",null,"",null,null,null,"",null,"",null,null,null,null,""]
[null,null,null,null,null,null,null,null,"25.144.267/0001-83","NOK","","",null,"",null,null,null,"",null,"",null,null,null,null,""]
[null,null,null,null,null,null,null,null,"25.144.267/0001-83","NOK","","",null,"",null,null,null,"",null,"",null,null,null,null,""]
[null,null,null,null,null,null,null,null,"25.144.267/0001-83","NOK","","",null,"",null,null,null,"",null,"",null,null,null,null,""]
[null,null,null,null,null,null,null,null,"25.144.267/0001-83","NOK","","",null,"",null,null,null,"",null,"",null,null,null,null,""]
[null,null,null,null,null,null,null,null,"25.144.267/0001-83","NOK","","",null,"",null,null,null,"",null,"",null,null,null,null,""]
[null,null,null,null,null,null,null,null,"25.144.267/0001-83","NOK","","",null,"",null,null,null,"",null,"",null,null,null,null,""]
[null,null,null,null,null,null,null,null,"25.144.267/0001-83","NOK","","",null,"",null,null,null,"",null,"",null,null,null,null,""]
[null,null,null,null,null,null,null,null,"25.144.267/0001-83","NOK","","",null,"",null,null,null,"",null,"",null,null,null,null,""]
[null,null,null,null,null,null,null,null,"25.144.267/0001-83","NOK","","",null,"",null,null,null,{"$f":"IF(Q763=\"\",\"\",IF(Q763=D763,\"OK\",\"NOK\"))","v":""},null,"",null,null,null,null,""]
[null,null,null,null,null,null,null,null,"25.144.267/0001-83","NOK","","",null,"",null,null,null,"",null,"",null,null,null,null,{"$f":"IF(A764=\"\",\"\",IF(V764=\"OK\",\"OK\",IF(AND(J764=\"OK\",L764=\"OK\",P764=\"OK\",R764=\"OK\"),\"OK\",\"NOK\")))","v":""}]
[null,null,null,null,null,null,null,null,"25.144.267/0001-83","NOK","","",null,"",null,null,null,"",null,"",null,null,null,null,""]
[null,null,null,null,null,null,null,null,"25.144.267/0001-83","NOK","","",null,"",null,null,null,"",null,"",null,null,null,null,""]
[null,null,null,null,null,null,null,null,"25.144.267/0001-83","NOK",{"$f":"IF(A767=\"\",\"\",EDATE(TODAY(),-24))","v":""},"",null,"",null,null,null,"",null,"",null,null,null,null,""]
[null,null,null,null,null,null,null,null,"25.144.267/0001-83","NOK","","",null,"",null,null,null,"",null,"",null,null,null,null,""]
[null,null,null,null,null,null,null,null,"25.144.267/0001-83","NOK","","",null,"",null,null,null,"",null,"",null,null,null,null,""]
[null,null,null,null,null,null,null,null,"25.144.267/0001-83","NOK","","",null,"",null,null,null,"",null,"",null,null,null,null,""]
[null,null,null,null,null,null,null,null,"25.144.267/0001-83","NOK","","",null,"",null,null,null,"",null,"",null,null,null,null,""]
[null,null,null,null,null,null,null,null,"25.144.267/0001-83","NOK","","",null,"",null,null,null,"",null,"",null,null,null,null,""]
[null,null,null,null,null,null,null,null,"25.144.267/0001-83","NOK","","",null,"",null,null,null,"",null,"",null,null,null,null,""]
[null,null,null,null,null,null,null,null,"25.144.267/0001-83","NOK","","",null,"",null,null,null,"",null,"",null,null,null,null,""]
[null,null,null,null,null,null,null,null,"25.144.267/0001-83","NOK","","",null,"",null,null,null,"",null,"",null,null,null,null,""]
[null,null,null,null,null,null,null,null,"25.144.267/0001-83","NOK","","",null,"",null,null,null,"",null,"",null,null,null,null,""]
[null,null,null,null,null,null,null,null,"25.144.267/0001-83","NOK","","",null,"",null,null,null,"",null,"",null,null,null,null,""]
[null,null,null,null,null,null,null,null,"25.144.267/0001-83","NOK","","",null,"",null,null,null,"",null,"",null,null,null,null,""]
[null,null,null,null,null,null,null,null,"25.144.267/0001-83","NOK","","",null,"",null,null,null,"",null,"",null,null,null,null,""]
[null,null,null,null,null,null,null,null,"25.144.267/0001-83","NOK","","",null,"",null,null,null,"",null,"",null,null,null,null,""]
[null,null,null,null,null,null,null,null,"25.144.267/0001-83","NOK","","",null,"",null,null,null,"",null,"",null,null,null,null,""]
[null,null,null,null,null,null,null,null,"25.144.267/0001-83","NOK","","",null,"",null,null,null,"",null,"",null,null,null,null,""]
[null,null,null,null,null,null,null,null,"25.144.267/0001-83","NOK","","",null,"",null,null,null,"",null,"",null,null,null,null,""]
[null,null,null,null,null,null,null,null,"25.144.267/0001-83","NOK","","",null,"",null,null,null,"",null,"",null,null,null,null,""]
[null,null,null,null,null,null,null,null,"25.144.267/0001-83","NOK","","",null,"",null,null,null,"",null,"",null,null,null,null,""]
[null,null,null,null,null,null,null,null,"25.144.267/0001-83","NOK","",{"$f":"IF(G786=\"\",\"\",IF(G786>=K786,\"OK\",\"NOK\"))","v":""},null,"",null,null,null,"",null,"",null,null,null,null,""]
[null,null,null,null,null,null,null,null,"25.144.267/0001-83","NOK","","",null,"",null,null,null,"",null,"",null,null,null,null,""]
[null,null,null,null,null,null,null,null,"25.144.267/0001-83",{"$f":"IF(I788=\"\",\"\",IF(OR(I788=H788,LEFT(H788,10)=LEFT(I788,10)),\"OK\",\"NOK\"))","v":"NOK"},"","",null,"",null,null,null,"",null,"",null,null,null,null,""]
[null,null,null,null,null,null,null,null,"25.144.267/0001-83","NOK","","",null,"",null,null,null,"",null,"",null,null,null,null,""]
[null,null,null,null,null,null,null,null,"25.144.267/0001-83","NOK","","",null,"",null,null,null,"",null,"",null,null,null,null,""]
[null,null,null,null,null,null,null,null,"25.144.267/0001-83","NOK","","",null,"",null,null,null,"",null,"",null,null,null,null,""]
[null,null,null,null,null,null,null,null,"25.144.267/0001-83","NOK","","",null,"",null,null,null,"",null,"",null,null,null,null,""]
[null,null,null,null,null,null,null,null,"25.144.267/0001-83","NOK","","",null,"",null,null,null,"",null,"",null,null,null,null,""]
[null,null,null,null,null,null,null,null,"25.144.267/0001-83","NOK","","",null,"",null,null,null,"",null,"",null,null,null,null,""]
[null,null,null,null,null,null,null,null,"25.144.267/0001-83","NOK","","",null,"",null,null,null,"",null,"",null,null,null,null,""]
[null,null,null,null,null,null,null,null,"25.144.267/0001-83","NOK","","",null,"",null,null,null,"",null,"",null,null,null,null,""]
[null,null,null,null,null,null,null,null,"25.144.267/0001-83","NOK","","",null,"",null,null,null,"",null,"",null,null,null,null,""]
[null,null,null,null,null,null,null,null,"25.144.267/0001-83","NOK","","",null,"",null,null,null,"",null,"",null,null,null,null,""]
[null,null,null,null,null,null,null,null,"25.144.267/0001-83","NOK","","",null,"",null,null,null,"",null,"",null,null,null,null,""]
[null,null,null,null,null,null,null,null,"25.144.267/0001-83","NOK","","",null,"",null,null,null,"",null,"",null,null,null,null,""]
[null,null,null,null,null,null,null,null,"25.144.267/0001-83","NOK","","",null,"",null,null,null,"",null,"",null,null,null,null,""]
[null,null,null,null,null,null,null,null,"25.144.267/0001-83","NOK","","",null,"",null,null,null,"",null,"",null,null,null,null,""]
[null,null,null,null,null,null,null,null,"25.144.267/0001-83","NOK","","",null,"",null,null,null,"",null,"",null,null,null,null,""]
[null,null,null,null,null,null,null,null,"25.144.267/0001-83","NOK","","",null,"",null,null,null,"",null,"",null,null,null,null,""]
[null,null,null,null,null,null,null,null,"25.144.267/0001-83","NOK","","",null,"",null,null,null,"",null,"",null,null,null,null,""]
[null,null,null,null,null,null,null,null,"25.144.267/0001-83","NOK","","",null,"",null,null,null,"",null,"",null,null,null,null,""]
[null,null,null,null,null,null,null,null,"25.144.267/0001-83","NOK","","",null,"",null,null,null,"",null,"",null,null,null,null,""]
[null,null,null,null,null,null,null,null,"25.144.267/0001-83","NOK","","",null,"",null,null,null,"",null,"",null,null,null,null,""]
[null,null,null,null,null,null,null,null,"25.144.267/0001-83","NOK","","",null,"",null,null,null,"",null,"",null,null,null,null,""]
[null,null,null,null,null,null,null,null,"25.144.267/0001-83","NOK","","",null,"",null,null,null,"",null,"",null,null,null,null,""]
[null,null,null,null,null,null,null,null,"25.144.267/0001-83","NOK","","",null,"",null,null,null,"",null,"",null,null,null,null,""]
[null,null,null,null,null,null,null,null,"25.144.267/0001-83","NOK","","",null,"",null,null,null,"",null,"",null,null,null,null,""]
[null,null,null,null,null,null,null,null,"25.144.267/0001-83","NOK","","",null,"",null,null,null,"",null,"",null,null,null,null,""]
[null,null,null,null,null,null,null,null,"25.144.267/0001-83","NOK","","",null,"",null,null,null,"",null,"",null,null,null,null,""]
[null,null,null,null,null,null,null,null,"25.144.267/0001-83","NOK","","",null,"",null,null,null,"",null,"",null,null,null,null,""]
[null,null,null,null,null,null,null,null,"25.144.267/0001-83","NOK","","",null,"",null,null,null,"",null,"",null,null,null,null,""]
[null,null,null,null,null,null,null,null,"25.144.267/0001-83","NOK","","",null,"",null,null,null,"",null,{"$f":"IF(S817=\"\",\"\",IF(S817=E817,\"OK\",\"NOK\"))","v":""},null,null,null,null,""]
[null,null,null,null,null,null,null,null,"25.144.267/0001-83","NOK","","",null,"",null,null,null,"",null,"",null,null,null,null,""]
[null,null,null,null,null,null,null,null,"25.144.267/0001-83","NOK","","",null,"",null,null,null,"",null,"",null,null,null,null,""]
[null,null,null,null,null,null,null,null,"25.144.267/0001-83","NOK","","",null,"",null,null,null,"",null,"",null,null,null,null,""]
[null,null,null,null,null,null,null,null,"25.144.267/0001-83","NOK","","",null,"",null,null,null,"",null,"",null,null,null,null,""]
[null,null,null,null,null,null,null,null,"25.144.267/0001-83","NOK","","",null,"",null,null,null,"",null,"",null,null,null,null,""]
[null,null,null,null,null,null,null,null,"25.144.267/0001-83","NOK","","",null,"",null,null,null,"",null,"",null,null,null,null,""]
[null,null,null,null,null,null,null,null,"25.144.267/0001-83","NOK","","",null,"",null,null,null,"",null,"",null,null,null,null,""]
[null,null,null,null,null,null,null,null,"25.144.267/0001-83","NOK","","",null,"",null,null,null,"",null,"",null,null,null,null,""]
[null,null,null,null,null,null,null,null,"25.144.267/0001-83","NOK","","",null,"",null,null,null,"",null,"",null,null,null,null,""]
[null,null,null,null,null,null,null,null,"25.144.267/0001-83","NOK","","",null,"",null,null,null,{"$f":"IF(Q827=\"\",\"\",IF(Q827=D827,\"OK\",\"NOK\"))","v":""},null,"",null,null,null,null,""]
[null,null,null,null,null,null,null,null,"25.144.267/0001-83","NOK","","",null,"",null,null,null,"",null,"",null,null,null,null,{"$f":"IF(A828=\"\",\"\",IF(V828=\"OK\",\"OK\",IF(AND(J828=\"OK\",L828=\"OK\",P828=\"OK\",R828=\"OK\"),\"OK\",\"NOK\")))","v":""}]
[null,null,null,null,null,null,null,null,"25.144.267/0001-83","NOK","","",null,"",null,null,null,"",null,"",null,null,null,null,""]
[null,null,null,null,null,null,null,null,"25.144.267/0001-83","NOK","","",null,"",null,null,null,"",null,"",null,null,null,null,""]
[null,null,null,null,null,null,null,null,"25.144.267/0001-83","NOK",{"$f":"IF(A831=\"\",\"\",EDATE(TODAY(),-24))","v":""},"",null,"",null,null,null,"",null,"",null,null,null,null,""]
[null,null,null,null,null,null,null,null,"25.144.267/0001-83","NOK","","",null,"",null,null,null,"",null,"",null,null,null,null,""]
[null,null,null,null,null,null,null,null,"25.144.267/0001-83","NOK","","",null,"",null,null,null,"",null,"",null,null,null,null,""]
[null,null,null,null,null,null,null,null,"25.144.267/0001-83","NOK","","",null,"",null,null,null,"",null,"",null,null,null,null,""]
[null,null,null,null,null,null,null,null,"25.144.267/0001-83","NOK","","",null,"",null,null,null,"",null,"",null,null,null,null,""]
[null,null,null,null,null,null,null,null,"25.144.267/0001-83","NOK","","",null,"",null,null,null,"",null,"",null,null,null,null,""]
[null,null,null,null,null,null,null,null,"25.144.267/0001-83","NOK","","",null,"",null,null,null,"",null,"",null,null,null,null,""]
[null,null,null,null,null,null,null,null,"25.144.267/0001-83","NOK","","",null,"",null,null,null,"",null,"",null,null,null,null,""]
[null,null,null,null,null,null,null,null,"25.144.267/0001-83","NOK","","",null,"",null,null,null,"",null,"",null,null,null,null,""]
[null,null,null,null,null,null,null,null,"25.144.267/0001-83","NOK","","",null,"",null,null,null,"",null,"",null,null,null,null,""]
[null,null,null,null,null,null,null,null,"25.144.267/0001-83","NOK","","",null,"",null,null,null,"",null,"",null,null,null,null,""]
[null,null,null,null,null,null,null,null,"25.144.267/0001-83","NOK","","",null,"",null,null,null,"",null,"",null,null,null,null,""]
[null,null,null,null,null,null,null,null,"25.144.267/0001-83","NOK","","",null,"",null,null,null,"",null,"",null,null,null,null,""]
[null,null,null,null,null,null,null,null,"25.144.267/0001-83","NOK","","",null,"",null,null,null,"",null,"",null,null,null,null,""]
[null,null,null,null,null,null,null,null,"25.144.267/0001-83","NOK","","",null,"",null,null,null,"",null,"",null,null,null,null,""]
[null,null,null,null,null,null,null,null,"25.144.267/0001-83","NOK","","",null,"",null,null,null,"",null,"",null,null,null,null,""]
[null,null,null,null,null,null,null,null,"25.144.267/0001-83","NOK","","",null,"",null,null,null,"",null,"",null,null,null,null,""]
[null,null,null,null,null,null,null,null,"25.144.267/0001-83","NOK","","",null,"",null,null,null,"",null,"",null,null,null,null,""]
[null,null,null,null,null,null,null,null,"25.144.267/0001-83","NOK","","",null,"",null,null,null,"",null,"",null,null,null,null,""]
[null,null,null,null,null,null,null,null,"25.144.267/0001-83","NOK","",{"$f":"IF(G850=\"\",\"\",IF(G850>=K850,\"OK\",\"NOK\"))","v":""},null,"",null,null,null,"",null,"",null,null,null,null,""]
[null,null,null,null,null,null,null,null,"25.144.267/0001-83","NOK","","",null,"",null,null,null,"",null,"",null,null,null,null,""]
[null,null,null,null,null,null,null,null,"25.144.267/0001-83",{"$f":"IF(I852=\"\",\"\",IF(OR(I852=H852,LEFT(H852,10)=LEFT(I852,10)),\"OK\",\"NOK\"))","v":"NOK"},"","",null,"",null,null,null,"",null,"",null,null,null,null,""]
[null,null,null,null,null,null,null,null,"25.144.267/0001-83","NOK","","",null,"",null,null,null,"",null,"",null,null,null,null,""]
[null,null,null,null,null,null,null,null,"25.144.267/0001-83","NOK","","",null,"",null,null,null,"",null,"",null,null,null,null,""]
[null,null,null,null,null,null,null,null,"25.144.267/0001-83","NOK","","",null,"",null,null,null,"",null,"",null,null,null,null,""]
[null,null,null,null,null,null,null,null,"25.144.267/0001-83","NOK","","",null,"",null,null,null,"",null,"",null,null,null,null,""]
[null,null,null,null,null,null,null,null,"25.144.267/0001-83","NOK","","",null,"",null,null,null,"",null,"",null,null,null,null,""]
[null,null,null,null,null,null,null,null,"25.144.267/0001-83","NOK","","",null,"",null,null,null,"",null,"",null,null,null,null,""]
[null,null,null,null,null,null,null,null,"25.144.267/0001-83","NOK","","",null,"",null,null,null,"",null,"",null,null,null,null,""]
[null,null,null,null,null,null,null,null,"25.144.267/0001-83","NOK","","",null,"",null,null,null,"",null,"",null,null,null,null,""]
[null,null,null,null,null,null,null,null,"25.144.267/0001-83","NOK","","",null,"",null,null,null,"",null,"",null,null,null,null,""]
[null,null,null,null,null,null,null,null,"25.144.267/0001-83","NOK","","",null,"",null,null,null,"",null,"",null,null,null,null,""]
[null,null,null,null,null,null,null,null,"25.144.267/0001-83","NOK","","",null,"",null,null,null,"",null,"",null,null,null,null,""]
[null,null,null,null,null,null,null,null,"25.144.267/0001-83","NOK","","",null,"",null,null,null,"",null,"",null,null,null,null,""]
[null,null,null,null,null,null,null,null,"25.144.267/0001-83","NOK","","",null,"",null,null,null,"",null,"",null,null,null,null,""]
[null,null,null,null,null,null,null,null,"25.144.267/0001-83","NOK","","",null,"",null,null,null,"",null,"",null,null,null,null,""]
[null,null,null,null,null,null,null,null,"25.144.267/0001-83","NOK","","",null,"",null,null,null,"",null,"",null,null,null,null,""]
[null,null,null,null,null,null,null,null,"25.144.267/0001-83","NOK","","",null,"",null,null,null,"",null,"",null,null,null,null,""]
[null,null,null,null,null,null,null,null,"25.144.267/0001-83","NOK","","",null,"",null,null,null,"",null,"",null,null,null,null,""]
[null,null,null,null,null,null,null,null,"25.144.267/0001-83","NOK","","",null,"",null,null,null,"",null,"",null,null,null,null,""]
[null,null,null,null,null,null,null,null,"25.144.267/0001-83","NOK","","",null,"",null,null,null,"",null,"",null,null,null,null,""]
[null,null,null,null,null,null,null,null,"25.144.267/0001-83","NOK","","",null,"",null,null,null,"",null,"",null,null,null,null,""]
[null,null,null,null,null,null,null,null,"25.144.267/0001-83","NOK","","",null,"",null,null,null,"",null,"",null,null,null,null,""]
[null,null,null,null,null,null,null,null,"25.144.267/0001-83","NOK","","",null,"",null,null,null,"",null,"",null,null,null,null,""]
[null,null,null,null,null,null,null,null,"25.144.267/0001-83","NOK","","",null,"",null,null,null,"",null,"",null,null,null,null,""]
[null,null,null,null,null,null,null,null,"25.144.267/0001-83","NOK","","",null,"",null,null,null,"",null,"",null,null,null,null,""]
[null,null,null,null,null,null,null,null,"25.144.267/0001-83","NOK","","",null,"",null,null,null,"",null,"",null,null,null,null,""]
[null,null,null,null,null,null,null,null,"25.144.267/0001-83","NOK","","",null,"",null,null,null,"",null,"",null,null,null,null,""]
[null,null,null,null,null,null,null,null,"25.144.267/0001-83","NOK","","",null,"",null,null,null,"",null,"",null,null,null,null,""]
[null,null,null,null,null,null,null,null,"25.144.267/0001-83","NOK","","",null,"",null,null,null,"",null,"",null,null,null,null,""]
[null,null,null,null,null,null,null,null,"25.144.267/0001-83","NOK","","",null,"",null,null,null,"",null,{"$f":"IF(S881=\"\",\"\",IF(S881=E881,\"OK\",\"NOK\"))","v":""},null,null,null,null,""]
[null,null,null,null,null,null,null,null,"25.144.267/0001-83","NOK","","",null,"",null,null,null,"",null,"",null,null,null,null,""]
[null,null,null,null,null,null,null,null,"25.144.267/0001-83","NOK","","",null,"",null,null,null,"",null,"",null,null,null,null,""]
[null,null,null,null,null,null,null,null,"25.144.267/0001-83","NOK","","",null,"",null,null,null,"",null,"",null,null,null,null,""]
[null,null,null,null,null,null,null,null,"25.144.267/0001-83","NOK","","",null,"",null,null,null,"",null,"",null,null,null,null,""]
[null,null,null,null,null,null,null,null,"25.144.267/0001-83","NOK","","",null,"",null,null,null,"",null,"",null,null,null,null,""]
[null,null,null,null,null,null,null,null,"25.144.267/0001-83","NOK","","",null,"",null,null,null,"",null,"",null,null,null,null,""]
[null,null,null,null,null,null,null,null,"25.144.267/0001-83","NOK","","",null,"",null,null,null,"",null,"",null,null,null,null,""]
[null,null,null,null,null,null,null,null,"25.144.267/0001-83","NOK","","",null,"",null,null,null,"",null,"",null,null,null,null,""]
[null,null,null,null,null,null,null,null,"25.144.267/0001-83","NOK","","",null,"",null,null,null,"",null,"",null,null,null,null,""]
[null,null,null,null,null,null,null,null,"25.144.267/0001-83","NOK","","",null,"",null,null,null,{"$f":"IF(Q891=\"\",\"\",IF(Q891=D891,\"OK\",\"NOK\"))","v":""},null,"",null,null,null,null,""]
[null,null,null,null,null,null,null,null,"25.144.267/0001-83","NOK","","",null,"",null,null,null,"",null,"",null,null,null,null,{"$f":"IF(A892=\"\",\"\",IF(V892=\"OK\",\"OK\",IF(AND(J892=\"OK\",L892=\"OK\",P892=\"OK\",R892=\"OK\"),\"OK\",\"NOK\")))","v":""}]
[null,null,null,null,null,null,null,null,"25.144.267/0001-83","NOK","","",null,"",null,null,null,"",null,"",null,null,null,null,""]
[null,null,null,null,null,null,null,null,"25.144.267/0001-83","NOK","","",null,"",null,null,null,"",null,"",null,null,null,null,""]
[null,null,null,null,null,null,null,null,"25.144.267/0001-83","NOK",{"$f":"IF(A895=\"\",\"\",EDATE(TODAY(),-24))","v":""},"",null,"",null,null,null,"",null,"",null,null,null,null,""]
[null,null,null,null,null,null,null,null,"25.144.267/0001-83","NOK","","",null,"",null,null,null,"",null,"",null,null,null,null,""]
[null,null,null,null,null,null,null,null,"25.144.267/0001-83","NOK","","",null,"",null,null,null,"",null,"",null,null,null,null,""]
[null,null,null,null,null,null,null,null,"25.144.267/0001-83","NOK","","",null,"",null,null,null,"",null,"",null,null,null,null,""]
[null,null,null,null,null,null,null,null,"25.144.267/0001-83","NOK","","",null,"",null,null,null,"",null,"",null,null,null,null,""]
[null,null,null,null,null,null,null,null,"25.144.267/0001-83","NOK","","",null,"",null,null,null,"",null,"",null,null,null,null,""]
[null,null,null,null,null,null,null,null,"25.144.267/0001-83","NOK","","",null,"",null,null,null,"",null,"",null,null,null,null,""]
[null,null,null,null,null,null,null,null,"25.144.267/0001-83","NOK","","",null,"",null,null,null,"",null,"",null,null,null,null,""]
[null,null,null,null,null,null,null,null,"25.144.267/0001-83","NOK","","",null,"",null,null,null,"",null,"",null,null,null,null,""]
[null,null,null,null,null,null,null,null,"25.144.267/0001-83","NOK","","",null,"",null,null,null,"",null,"",null,null,null,null,""]
[null,null,null,null,null,null,null,null,"25.144.267/0001-83","NOK","","",null,"",null,null,null,"",null,"",null,null,null,null,""]
[null,null,null,null,null,null,null,null,"25.144.267/0001-83","NOK","","",null,"",null,null,null,"",null,"",null,null,null,null,""]
[null,null,null,null,null,null,null,null,"25.144.267/0001-83","NOK","","",null,"",null,null,null,"",null,"",null,null,null,null,""]
[null,null,null,null,null,null,null,null,"25.144.267/0001-83","NOK","","",null,"",null,null,null,"",null,"",null,null,null,null,""]
[null,null,null,null,null,null,null,null,"25.144.267/0001-83","NOK","","",null,"",null,null,null,"",null,"",null,null,null,null,""]
[null,null,null,null,null,null,null,null,"25.144.267/0001-83","NOK","","",null,"",null,null,null,"",null,"",null,null,null,null,""]
[null,null,null,null,null,null,null,null,"25.144.267/0001-83","NOK","","",null,"",null,null,null,"",null,"",null,null,null,null,""]
[null,null,null,null,null,null,null,null,"25.144.267/0001-83","NOK","","",null,"",null,null,null,"",null,"",null,null,null,null,""]
[null,null,null,null,null,null,null,null,"25.144.267/0001-83","NOK","","",null,"",null,null,null,"",null,"",null,null,null,null,""]
[null,null,null,null,null,null,null,null,"25.144.267/0001-83","NOK","",{"$f":"IF(G914=\"\",\"\",IF(G914>=K914,\"OK\",\"NOK\"))","v":""},null,"",null,null,null,"",null,"",null,null,null,null,""]
[null,null,null,null,null,null,null,null,"25.144.267/0001-83","NOK","","",null,"",null,null,null,"",null,"",null,null,null,null,""]
[null,null,null,null,null,null,null,null,"25.144.267/0001-83",{"$f":"IF(I916=\"\",\"\",IF(OR(I916=H916,LEFT(H916,10)=LEFT(I916,10)),\"OK\",\"NOK\"))","v":"NOK"},"","",null,"",null,null,null,"",null,"",null,null,null,null,""]
[null,null,null,null,null,null,null,null,"25.144.267/0001-83","NOK","","",null,"",null,null,null,"",null,"",null,null,null,null,""]
[null,null,null,null,null,null,null,null,"25.144.267/0001-83","NOK","","",null,"",null,null,null,"",null,"",null,null,null,null,""]
[null,null,null,null,null,null,null,null,"25.144.267/0001-83","NOK","","",null,"",null,null,null,"",null,"",null,null,null,null,""]
[null,null,null,null,null,null,null,null,"25.144.267/0001-83","NOK","","",null,"",null,null,null,"",null,"",null,null,null,null,""]
[null,null,null,null,null,null,null,null,"25.144.267/0001-83","NOK","","",null,"",null,null,null,"",null,"",null,null,null,null,""]
[null,null,null,null,null,null,null,null,"25.144.267/0001-83","NOK","","",null,"",null,null,null,"",null,"",null,null,null,null,""]
[null,null,null,null,null,null,null,null,"25.144.267/0001-83","NOK","","",null,"",null,null,null,"",null,"",null,null,null,null,""]
[null,null,null,null,null,null,null,null,"25.144.267/0001-83","NOK","","",null,"",null,null,null,"",null,"",null,null,null,null,""]
[null,null,null,null,null,null,null,null,"25.144.267/0001-83","NOK","","",null,"",null,null,null,"",null,"",null,null,null,null,""]
[null,null,null,null,null,null,null,null,"25.144.267/0001-83","NOK","","",null,"",null,null,null,"",null,"",null,null,null,null,""]
[null,null,null,null,null,null,null,null,"25.144.267/0001-83","NOK","","",null,"",null,null,null,"",null,"",null,null,null,null,""]
[null,null,null,null,null,null,null,null,"25.144.267/0001-83","NOK","","",null,"",null,null,null,"",null,"",null,null,null,null,""]
[null,null,null,null,null,null,null,null,"25.144.267/0001-83","NOK","","",null,"",null,null,null,"",null,"",null,null,null,null,""]
[null,null,null,null,null,null,null,null,"25.144.267/0001-83","NOK","","",null,"",null,null,null,"",null,"",null,null,null,null,""]
[null,null,null,null,null,null,null,null,"25.144.267/0001-83","NOK","","",null,"",null,null,null,"",null,"",null,null,null,null,""]
[null,null,null,null,null,null,null,null,"25.144.267/0001-83","NOK","","",null,"",null,null,null,"",null,"",null,null,null,null,""]
[null,null,null,null,null,null,null,null,"25.144.267/0001-83","NOK","","",null,"",null,null,null,"",null,"",null,null,null,null,""]
[null,null,null,null,null,null,null,null,"25.144.267/0001-83","NOK","","",null,"",null,null,null,"",null,"",null,null,null,null,""]
[null,null,null,null,null,null,null,null,"25.144.267/0001-83","NOK","","",null,"",null,null,null,"",null,"",null,null,null,null,""]
[null,null,null,null,null,null,null,null,"25.144.267/0001-83","NOK","","",null,"",null,null,null,"",null,"",null,null,null,null,""]
[null,null,null,null,null,null,null,null,"25.144.267/0001-83","NOK","","",null,"",null,null,null,"",null,"",null,null,null,null,""]
[null,null,null,null,null,null,null,null,"25.144.267/0001-83","NOK","","",null,"",null,null,null,"",null,"",null,null,null,null,""]
[null,null,null,null,null,null,null,null,"25.144.267/0001-83","NOK","","",null,"",null,null,null,"",null,"",null,null,null,null,""]
[null,null,null,null,null,null,null,null,"25.144.267/0001-83","NOK","","",null,"",null,null,null,"",null,"",null,null,null,null,""]
[null,null,null,null,null,null,null,null,"25.144.267/0001-83","NOK","","",null,"",null,null,null,"",null,"",null,null,null,null,""]
[null,null,null,null,null,null,null,null,"25.144.267/0001-83","NOK","","",null,"",null,null,null,"",null,"",null,null,null,null,""]
[null,null,null,null,null,null,null,null,"25.144.267/0001-83","NOK","","",null,"",null,null,null,"",null,"",null,null,null,null,""]
[null,null,null,null,null,null,null,null,"25.144.267/0001-83","NOK","","",null,"",null,null,null,"",null,"",null,null,null,null,""]
[null,null,null,null,null,null,null,null,"25.144.267/0001-83","NOK","","",null,"",null,null,null,"",null,{"$f":"IF(S945=\"\",\"\",IF(S945=E945,\"OK\",\"NOK\"))","v":""},null,null,null,null,""]
[null,null,null,null,null,null,null,null,"25.144.267/0001-83","NOK","","",null,"",null,null,null,"",null,"",null,null,null,null,""]
[null,null,null,null,null,null,null,null,"25.144.267/0001-83","NOK","","",null,"",null,null,null,"",null,"",null,null,null,null,""]
[null,null,null,null,null,null,null,null,"25.144.267/0001-83","NOK","","",null,"",null,null,null,"",null,"",null,null,null,null,""]
[null,null,null,null,null,null,null,null,"25.144.267/0001-83","NOK","","",null,"",null,null,null,"",null,"",null,null,null,null,""]
[null,null,null,null,null,null,null,null,"25.144.267/0001-83","NOK","","",null,"",null,null,null,"",null,"",null,null,null,null,""]
[null,null,null,null,null,null,null,null,"25.144.267/0001-83","NOK","","",null,"",null,null,null,"",null,"",null,null,null,null,""]
[null,null,null,null,null,null,null,null,"25.144.267/0001-83","NOK","","",null,"",null,null,null,"",null,"",null,null,null,null,""]
[null,null,null,null,null,null,null,null,"25.144.267/0001-83","NOK","","",null,"",null,null,null,"",null,"",null,null,null,null,""]
[null,null,null,null,null,null,null,null,"25.144.267/0001-83","NOK","","",null,"",null,null,null,"",null,"",null,null,null,null,""]
[null,null,null,null,null,null,null,null,"25.144.267/0001-83","NOK","","",null,"",null,null,null,{"$f":"IF(Q955=\"\",\"\",IF(Q955=D955,\"OK\",\"NOK\"))","v":""},null,"",null,null,null,null,""]
[null,null,null,null,null,null,null,null,"25.144.267/0001-83","NOK","","",null,"",null,null,null,"",null,"",null,null,null,null,{"$f":"IF(A956=\"\",\"\",IF(V956=\"OK\",\"OK\",IF(AND(J956=\"OK\",L956=\"OK\",P956=\"OK\",R956=\"OK\"),\"OK\",\"NOK\")))","v":""}]
[null,null,null,null,null,null,null,null,"25.144.267/0001-83","NOK","","",null,"",null,null,null,"",null,"",null,null,null,null,""]
[null,null,null,null,null,null,null,null,"25.144.267/0001-83","NOK","","",null,"",null,null,null,"",null,"",null,null,null,null,""]
[null,null,null,null,null,null,null,null,"25.144.267/0001-83","NOK",{"$f":"IF(A959=\"\",\"\",EDATE(TODAY(),-24))","v":""},"",null,"",null,null,null,"",null,"",null,null,null,null,""]
[null,null,null,null,null,null,null,null,"25.144.267/0001-83","NOK","","",null,"",null,null,null,"",null,"",null,null,null,null,""]
[null,null,null,null,null,null,null,null,"25.144.267/0001-83","NOK","","",null,"",null,null,null,"",null,"",null,null,null,null,""]
[null,null,null,null,null,null,null,null,"25.144.267/0001-83","NOK","","",null,"",null,null,null,"",null,"",null,null,null,null,""]
[null,null,null,null,null,null,null,null,"25.144.267/0001-83","NOK","","",null,"",null,null,null,"",null,"",null,null,null,null,""]
[null,null,null,null,null,null,null,null,"25.144.267/0001-83","NOK","","",null,"",null,null,null,"",null,"",null,null,null,null,""]
[null,null,null,null,null,null,null,null,"25.144.267/0001-83","NOK","","",null,"",null,null,null,"",null,"",null,null,null,null,""]
[null,null,null,null,null,null,null,null,"25.144.267/0001-83","NOK","","",null,"",null,null,null,"",null,"",null,null,null,null,""]
[null,null,null,null,null,null,null,null,"25.144.267/0001-83","NOK","","",null,"",null,null,null,"",null,"",null,null,null,null,""]
[null,null,null,null,null,null,null,null,"25.144.267/0001-83","NOK","","",null,"",null,null,null,"",null,"",null,null,null,null,""]
[null,null,null,null,null,null,null,null,"25.144.267/0001-83","NOK","","",null,"",null,null,null,"",null,"",null,null,null,null,""]
[null,null,null,null,null,null,null,null,"25.144.267/0001-83","NOK","","",null,"",null,null,null,"",null,"",null,null,null,null,""]
[null,null,null,null,null,null,null,null,"25.144.267/0001-83","NOK","","",null,"",null,null,null,"",null,"",null,null,null,null,""]
[null,null,null,null,null,null,null,null,"25.144.267/0001-83","NOK","","",null,"",null,null,null,"",null,"",null,null,null,null,""]
[null,null,null,null,null,null,null,null,"25.144.267/0001-83","NOK","","",null,"",null,null,null,"",null,"",null,null,null,null,""]
[null,null,null,null,null,null,null,null,"25.144.267/0001-83","NOK","","",null,"",null,null,null,"",null,"",null,null,null,null,""]
[null,null,null,null,null,null,null,null,"25.144.267/0001-83","NOK","","",null,"",null,null,null,"",null,"",null,null,null,null,""]
[null,null,null,null,null,null,null,null,"25.144.267/0001-83","NOK","","",null,"",null,null,null,"",null,"",null,null,null,null,""]
[null,null,null,null,null,null,null,null,"25.144.267/0001-83","NOK","","",null,"",null,null,null,"",null,"",null,null,null,null,""]
[null,null,null,null,null,null,null,null,"25.144.267/0001-83","NOK","",{"$f":"IF(G978=\"\",\"\",IF(G978>=K978,\"OK\",\"NOK\"))","v":""},null,"",null,null,null,"",null,"",null,null,null,null,""]
[null,null,null,null,null,null,null,null,"25.144.267/0001-83","NOK","","",null,"",null,null,null,"",null,"",null,null,null,null,""]
[null,null,null,null,null,null,null,null,"25.144.267/0001-83",{"$f":"IF(I980=\"\",\"\",IF(OR(I980=H980,LEFT(H980,10)=LEFT(I980,10)),\"OK\",\"NOK\"))","v":"NOK"},"","",null,"",null,null,null,"",null,"",null,null,null,null,""]
[null,null,null,null,null,null,null,null,"25.144.267/0001-83","NOK","","",null,"",null,null,null,"",null,"",null,null,null,null,""]
[null,null,null,null,null,null,null,null,"25.144.267/0001-83","NOK","","",null,"",null,null,null,"",null,"",null,null,null,null,""]
[null,null,null,null,null,null,null,null,"25.144.267/0001-83","NOK","","",null,"",null,null,null,"",null,"",null,null,null,null,""]
[null,null,null,null,null,null,null,null,"25.144.267/0001-83","NOK","","",null,"",null,null,null,"",null,"",null,null,null,null,""]
[null,null,null,null,null,null,null,null,"25.144.267/0001-83","NOK","","",null,"",null,null,null,"",null,"",null,null,null,null,""]
[null,null,null,null,null,null,null,null,"25.144.267/0001-83","NOK","","",null,"",null,null,null,"",null,"",null,null,null,null,""]
[null,null,null,null,null,null,null,null,"25.144.267/0001-83","NOK","","",null,"",null,null,null,"",null,"",null,null,null,null,""]
[null,null,null,null,null,null,null,null,"25.144.267/0001-83","NOK","","",null,"",null,null,null,"",null,"",null,null,null,null,""]
[null,null,null,null,null,null,null,null,"25.144.267/0001-83","NOK","","",null,"",null,null,null,"",null,"",null,null,null,null,""]
[null,null,null,null,null,null,null,null,"25.144.267/0001-83","NOK","","",null,"",null,null,null,"",null,"",null,null,null,null,""]
[null,null,null,null,null,null,null,null,"25.144.267/0001-83","NOK","","",null,"",null,null,null,"",null,"",null,null,null,null,""]
[null,null,null,null,null,null,null,null,"25.144.267/0001-83","NOK","","",null,"",null,null,null,"",null,"",null,null,null,null,""]
[null,null,null,null,null,null,null,null,"25.144.267/0001-83","NOK","","",null,"",null,null,null,"",null,"",null,null,null,null,""]
[null,null,null,null,null,null,null,null,"25.144.267/0001-83","NOK","","",null,"",null,null,null,"",null,"",null,null,null,null,""]
[null,null,null,null,null,null,null,null,"25.144.267/0001-83","NOK","","",null,"",null,null,null,"",null,"",null,null,null,null,""]
[null,null,null,null,null,null,null,null,"25.144.267/0001-83","NOK","","",null,"",null,null,null,"",null,"",null,null,null,null,""]
[null,null,null,null,null,null,null,null,"25.144.267/0001-83","NOK","","",null,"",null,null,null,"",null,"",null,null,null,null,""]
[null,null,null,null,null,null,null,null,"25.144.267/0001-83","NOK","","",null,"",null,null,null,"",null,"",null,null,null,null,""]
[null,null,null,null,null,null,null,null,"25.144.267/0001-83","NOK","","",null,"",null,null,null,"",null,"",null,null,null,null,""]
[null,null,null,null,null,null,null,null,"25.144.267/0001-83","NOK","","",null,"",null,null,null,"",null,"",null,null,null,null,""]
[null,null,null,null,null,null,null,null,"25.144.267/0001-83","NOK","","",null,"",null,null,null,"",null,"",null,null,null,null,""]
[null,null,null,null,null,null,null,null,"25.144.267/0001-83","NOK","","",null,"",null,null,null,"",null,"",null,null,null,null,""]
[null,null,null,null,null,null,null,null,"25.144.267/0001-83","NOK","","",null,"",null,null,null,"",null,"",null,null,null,null,""]
[null,null,null,null,null,null,null,null,"25.144.267/0001-83","NOK","","",null,"",null,null,null,"",null,"",null,null,null,null,""]
[null,null,null,null,null,null,null,null,"25.144.267/0001-83","NOK","","",null,"",null,null,null,"",null,"",null,null,null,null,""]
[null,null,null,null,null,null,null,null,"25.144.267/0001-83","NOK","","",null,"",null,null,null,"",null,"",null,null,null,null,""]
[null,null,null,null,null,null,null,null,"25.144.267/0001-83","NOK","","",null,"",null,null,null,"",null,"",null,null,null,null,""]
[null,null,null,null,null,null,null,null,"25.144.267/0001-83","NOK","","",null,"",null,null,null,"",null,"",null,null,null,null,""]
[null,null,null,null,null,null,null,null,"25.144.267/0001-83","NOK","","",null,"",null,null,null,"",null,{"$f":"IF(S1009=\"\",\"\",IF(S1009=E1009,\"OK\",\"NOK\"))","v":""},null,null,null,null,""]
[null,null,null,null,null,null,null,null,"25.144.267/0001-83","NOK","","",null,"",null,null,null,"",null,"",null,null,null,null,""]
[null,null,null,null,null,null,null,null,"25.144.267/0001-83","NOK","","",null,"",null,null,null,"",null,"",null,null,null,null,""]
[null,null,null,null,null,null,null,null,"25.144.267/0001-83","NOK","","",null,"",null,null,null,"",null,"",null,null,null,null,""]
[null,null,null,null,null,null,null,null,"25.144.267/0001-83","NOK","","",null,"",null,null,null,"",null,"",null,null,null,null,""]
[null,null,null,null,null,null,null,null,"25.144.267/0001-83","NOK","","",null,"",null,null,null,"",null,"",null,null,null,null,""]
[null,null,null,null,null,null,null,null,"25.144.267/0001-83","NOK","","",null,"",null,null,null,"",null,"",null,null,null,null,""]
[null,null,null,null,null,null,null,null,"25.144.267/0001-83","NOK","","",null,"",null,null,null,"",null,"",null,null,null,null,""]
[null,null,null,null,null,null,null,null,"25.144.267/0001-83","NOK","","",null,"",null,null,null,"",null,"",null,null,null,null,""]
[null,null,null,null,null,null,null,null,"25.144.267/0001-83","NOK","","",null,"",null,null,null,"",null,"",null,null,null,null,""]
[null,null,null,null,null,null,null,null,"25.144.267/0001-83","NOK","","",null,"",null,null,null,{"$f":"IF(Q1019=\"\",\"\",IF(Q1019=D1019,\"OK\",\"NOK\"))","v":""},null,"",null,null,null,null,""]
[null,null,null,null,null,null,null,null,"25.144.267/0001-83","NOK","","",null,"",null,null,null,"",null,"",null,null,null,null,{"$f":"IF(A1020=\"\",\"\",IF(V1020=\"OK\",\"OK\",IF(AND(J1020=\"OK\",L1020=\"OK\",P1020=\"OK\",R1020=\"OK\"),\"OK\",\"NOK\")))","v":""}]
[null,null,null,null,null,null,null,null,"25.144.267/0001-83","NOK","","",null,"",null,null,null,"",null,"",null,null,null,null,""]
[null,null,null,null,null,null,null,null,"25.144.267/0001-83","NOK","","",null,"",null,null,null,"",null,"",null,null,null,null,""]
[null,null,null,null,null,null,null,null,"25.144.267/0001-83","NOK",{"$f":"IF(A1023=\"\",\"\",EDATE(TODAY(),-24))","v":""},"",null,"",null,null,null,"",null,"",null,null,null,null,""]
[null,null,null,null,null,null,null,null,"25.144.267/0001-83","NOK","","",null,"",null,null,null,"",null,"",null,null,null,null,""]
[null,null,null,null,null,null,null,null,"25.144.267/0001-83","NOK","","",null,"",null,null,null,"",null,"",null,null,null,null,""]
[null,null,null,null,null,null,null,null,"25.144.267/0001-83","NOK","","",null,"",null,null,null,"",null,"",null,null,null,null,""]
[null,null,null,null,null,null,null,null,"25.144.267/0001-83","NOK","","",null,"",null,null,null,"",null,"",null,null,null,null,""]
[null,null,null,null,null,null,null,null,"25.144.267/0001-83","NOK","","",null,"",null,null,null,"",null,"",null,null,null,null,""]
[null,null,null,null,null,null,null,null,"25.144.267/0001-83","NOK","","",null,"",null,null,null,"",null,"",null,null,null,null,""]
[null,null,null,null,null,null,null,null,"25.144.267/0001-83","NOK","","",null,"",null,null,null,"",null,"",null,null,null,null,""]
[null,null,null,null,null,null,null,null,"25.144.267/0001-83","NOK","","",null,"",null,null,null,"",null,"",null,null,null,null,""]
[null,null,null,null,null,null,null,null,"25.144.267/0001-83","NOK","","",null,"",null,null,null,"",null,"",null,null,null,null,""]
[null,null,null,null,null,null,null,null,"25.144.267/0001-83","NOK","","",null,"",null,null,null,"",null,"",null,null,null,null,""]
[null,null,null,null,null,null,null,null,"25.144.267/0001-83","NOK","","",null,"",null,null,null,"",null,"",null,null,null,null,""]
[null,null,null,null,null,null,null,null,"25.144.267/0001-83","NOK","","",null,"",null,null,null,"",null,"",null,null,null,null,""]
[null,null,null,null,null,null,null,null,"25.144.267/0001-83","NOK","","",null,"",null,null,null,"",null,"",null,null,null,null,""]
[null,null,null,null,null,null,null,null,"25.144.267/0001-83","NOK","","",null,"",null,null,null,"",null,"",null,null,null,null,""]
[null,null,null,null,null,null,null,null,"25.144.267/0001-83","NOK","","",null,"",null,null,null,"",null,"",null,null,null,null,""]
[null,null,null,null,null,null,null,null,"25.144.267/0001-83","NOK","","",null,"",null,null,null,"",null,"",null,null,null,null,""]
[null,null,null,null,null,null,null,null,"25.144.267/0001-83","NOK","","",null,"",null,null,null,"",null,"",null,null,null,null,""]
[null,null,null,null,null,null,null,null,"25.144.267/0001-83","NOK","","",null,"",null,null,null,"",null,"",null,null,null,null,""]
[null,null,null,null,null,null,null,null,"25.144.267/0001-83","NOK","",{"$f":"IF(G1042=\"\",\"\",IF(G1042>=K1042,\"OK\",\"NOK\"))","v":""},null,"",null,null,null,"",null,"",null,null,null,null,""]
[null,null,null,null,null,null,null,null,"25.144.267/0001-83","NOK","","",null,"",null,null,null,"",null,"",null,null,null,null,""]
[null,null,null,null,null,null,null,null,"25.144.267/0001-83",{"$f":"IF(I1044=\"\",\"\",IF(OR(I1044=H1044,LEFT(H1044,10)=LEFT(I1044,10)),\"OK\",\"NOK\"))","v":"NOK"},"","",null,"",null,null,null,"",null,"",null,null,null,null,""]
[null,null,null,null,null,null,null,null,"25.144.267/0001-83","NOK","","",null,"",null,null,null,"",null,"",null,null,null,null,""]
[null,null,null,null,null,null,null,null,"25.144.267/0001-83","NOK","","",null,"",null,null,null,"",null,"",null,null,null,null,""]
[null,null,null,null,null,null,null,null,"25.144.267/0001-83","NOK","","",null,"",null,null,null,"",null,"",null,null,null,null,""]
[null,null,null,null,null,null,null,null,"25.144.267/0001-83","NOK","","",null,"",null,null,null,"",null,"",null,null,null,null,""]
[null,null,null,null,null,null,null,null,"25.144.267/0001-83","NOK","","",null,"",null,null,null,"",null,"",null,null,null,null,""]
[null,null,null,null,null,null,null,null,"25.144.267/0001-83","NOK","","",null,"",null,null,null,"",null,"",null,null,null,null,""]
[null,null,null,null,null,null,null,null,"25.144.267/0001-83","NOK","","",null,"",null,null,null,"",null,"",null,null,null,null,""]
[null,null,null,null,null,null,null,null,"25.144.267/0001-83","NOK","","",null,"",null,null,null,"",null,"",null,null,null,null,""]
[null,null,null,null,null,null,null,null,"25.144.267/0001-83","NOK","","",null,"",null,null,null,"",null,"",null,null,null,null,""]
[null,null,null,null,null,null,null,null,"25.144.267/0001-83","NOK","","",null,"",null,null,null,"",null,"",null,null,null,null,""]
[null,null,null,null,null,null,null,null,"25.144.267/0001-83","NOK","","",null,"",null,null,null,"",null,"",null,null,null,null,""]
[null,null,null,null,null,null,null,null,"25.144.267/0001-83","NOK","","",null,"",null,null,null,"",null,"",null,null,null,null,""]
[null,null,null,null,null,null,null,null,"25.144.267/0001-83","NOK","","",null,"",null,null,null,"",null,"",null,null,null,null,""]
[null,null,null,null,null,null,null,null,"25.144.267/0001-83","NOK","","",null,"",null,null,null,"",null,"",null,null,null,null,""]
[null,null,null,null,null,null,null,null,"25.144.267/0001-83","NOK","","",null,"",null,null,null,"",null,"",null,null,null,null,""]
[null,null,null,null,null,null,null,null,"25.144.267/0001-83","NOK","","",null,"",null,null,null,"",null,"",null,null,null,null,""]
[null,null,null,null,null,null,null,null,"25.144.267/0001-83","NOK","","",null,"",null,null,null,"",null,"",null,null,null,null,""]
[null,null,null,null,null,null,null,null,"25.144.267/0001-83","NOK","","",null,"",null,null,null,"",null,"",null,null,null,null,""]
[null,null,null,null,null,null,null,null,"25.144.267/0001-83","NOK","","",null,"",null,null,null,"",null,"",null,null,null,null,""]
[null,null,null,null,null,null,null,null,"25.144.267/0001-83","NOK","","",null,"",null,null,null,"",null,"",null,null,null,null,""]
[null,null,null,null,null,null,null,null,"25.144.267/0001-83","NOK","","",null,"",null,null,null,"",null,"",null,null,null,null,""]
[null,null,null,null,null,null,null,null,"25.144.267/0001-83","NOK","","",null,"",null,null,null,"",null,"",null,null,null,null,""]
[null,null,null,null,null,null,null,null,"25.144.267/0001-83","NOK","","",null,"",null,null,null,"",null,"",null,null,null,null,""]
[null,null,null,null,null,null,null,null,"25.144.267/0001-83","NOK","","",null,"",null,null,null,"",null,"",null,null,null,null,""]
[null,null,null,null,null,null,null,null,"25.144.267/0001-83","NOK","","",null,"",null,null,null,"",null,"",null,null,null,null,""]
[null,null,null,null,null,null,null,null,"25.144.267/0001-83","NOK","","",null,"",null,null,null,"",null,"",null,null,null,null,""]
[null,null,null,null,null,null,null,null,"25.144.267/0001-83","NOK","","",null,"",null,null,null,"",null,"",null,null,null,null,""]
[null,null,null,null,null,null,null,null,"25.144.267/0001-83","NOK","","",null,"",null,null,null,"",null,"",null,null,null,null,""]
[null,null,null,null,null,null,null,null,"25.144.267/0001-83","NOK","","",null,"",null,null,null,"",null,{"$f":"IF(S1073=\"\",\"\",IF(S1073=E1073,\"OK\",\"NOK\"))","v":""},null,null,null,null,""]
[null,null,null,null,null,null,null,null,"25.144.267/0001-83","NOK","","",null,"",null,null,null,"",null,"",null,null,null,null,""]
[null,null,null,null,null,null,null,null,"25.144.267/0001-83","NOK","","",null,"",null,null,null,"",null,"",null,null,null,null,""]
[null,null,null,null,null,null,null,null,"25.144.267/0001-83","NOK","","",null,"",null,null,null,"",null,"",null,null,null,null,""]
[null,null,null,null,null,null,null,null,"25.144.267/0001-83","NOK","","",null,"",null,null,null,"",null,"",null,null,null,null,""]
[null,null,null,null,null,null,null,null,"25.144.267/0001-83","NOK","","",null,"",null,null,null,"",null,"",null,null,null,null,""]
[null,null,null,null,null,null,null,null,"25.144.267/0001-83","NOK","","",null,"",null,null,null,"",null,"",null,null,null,null,""]
[null,null,null,null,null,null,null,null,"25.144.267/0001-83","NOK","","",null,"",null,null,null,"",null,"",null,null,null,null,""]
[null,null,null,null,null,null,null,null,"25.144.267/0001-83","NOK","","",null,"",null,null,null,"",null,"",null,null,null,null,""]
[null,null,null,null,null,null,null,null,"25.144.267/0001-83","NOK","","",null,"",null,null,null,"",null,"",null,null,null,null,""]
[null,null,null,null,null,null,null,null,"25.144.267/0001-83","NOK","","",null,"",null,null,null,{"$f":"IF(Q1083=\"\",\"\",IF(Q1083=D1083,\"OK\",\"NOK\"))","v":""},null,"",null,null,null,null,""]
[null,null,null,null,null,null,null,null,"25.144.267/0001-83","NOK","","",null,"",null,null,null,"",null,"",null,null,null,null,{"$f":"IF(A1084=\"\",\"\",IF(V1084=\"OK\",\"OK\",IF(AND(J1084=\"OK\",L1084=\"OK\",P1084=\"OK\",R1084=\"OK\"),\"OK\",\"NOK\")))","v":""}]
[null,null,null,null,null,null,null,null,"25.144.267/0001-83","NOK","","",null,"",null,null,null,"",null,"",null,null,null,null,""]
[null,null,null,null,null,null,null,null,"25.144.267/0001-83","NOK","","",null,"",null,null,null,"",null,"",null,null,null,null,""]
[null,null,null,null,null,null,null,null,"25.144.267/0001-83","NOK",{"$f":"IF(A1087=\"\",\"\",EDATE(TODAY(),-24))","v":""},"",null,"",null,null,null,"",null,"",null,null,null,null,""]
[null,null,null,null,null,null,null,null,"25.144.267/0001-83","NOK","","",null,"",null,null,null,"",null,"",null,null,null,null,""]
[null,null,null,null,null,null,null,null,"25.144.267/0001-83","NOK","","",null,"",null,null,null,"",null,"",null,null,null,null,""]
[null,null,null,null,null,null,null,null,"25.144.267/0001-83","NOK","","",null,"",null,null,null,"",null,"",null,null,null,null,""]
[null,null,null,null,null,null,null,null,"25.144.267/0001-83","NOK","","",null,"",null,null,null,"",null,"",null,null,null,null,""]
[null,null,null,null,null,null,null,null,"25.144.267/0001-83","NOK","","",null,"",null,null,null,"",null,"",null,null,null,null,""]
[null,null,null,null,null,null,null,null,"25.144.267/0001-83","NOK","","",null,"",null,null,null,"",null,"",null,null,null,null,""]
[null,null,null,null,null,null,null,null,"25.144.267/0001-83","NOK","","",null,"",null,null,null,"",null,"",null,null,null,null,""]
[null,null,null,null,null,null,null,null,"25.144.267/0001-83","NOK","","",null,"",null,null,null,"",null,"",null,null,null,null,""]
[null,null,null,null,null,null,null,null,"25.144.267/0001-83","NOK","","",null,"",null,null,null,"",null,"",null,null,null,null,""]
[null,null,null,null,null,null,null,null,"25.144.267/0001-83","NOK","","",null,"",null,null,null,"",null,"",null,null,null,null,""]
[null,null,null,null,null,null,null,null,"25.144.267/0001-83","NOK","","",null,"",null,null,null,"",null,"",null,null,null,null,""]
[null,null,null,null,null,null,null,null,"25.144.267/0001-83","NOK","","",null,"",null,null,null,"",null,"",null,null,null,null,""]
[null,null,null,null,null,null,null,null,"25.144.267/0001-83","NOK","","",null,"",null,null,null,"",null,"",null,null,null,null,""]
[null,null,null,null,null,null,null,null,"25.144.267/0001-83","NOK","","",null,"",null,null,null,"",null,"",null,null,null,null,""]
[null,null,null,null,null,null,null,null,"25.144.267/0001-83","NOK","","",null,"",null,null,null,"",null,"",null,null,null,null,""]
[null,null,null,null,null,null,null,null,"25.144.267/0001-83","NOK","","",null,"",null,null,null,"",null,"",null,null,null,null,""]
[null,null,null,null,null,null,null,null,"25.144.267/0001-83","NOK","","",null,"",null,null,null,"",null,"",null,null,null,null,""]
[null,null,null,null,null,null,null,null,"25.144.267/0001-83","NOK","","",null,"",null,null,null,"",null,"",null,null,null,null,""]
[null,null,null,null,null,null,null,null,"25.144.267/0001-83","NOK","",{"$f":"IF(G1106=\"\",\"\",IF(G1106>=K1106,\"OK\",\"NOK\"))","v":""},null,"",null,null,null,"",null,"",null,null,null,null,""]
[null,null,null,null,null,null,null,null,"25.144.267/0001-83","NOK","","",null,"",null,null,null,"",null,"",null,null,null,null,""]
[null,null,null,null,null,null,null,null,"25.144.267/0001-83",{"$f":"IF(I1108=\"\",\"\",IF(OR(I1108=H1108,LEFT(H1108,10)=LEFT(I1108,10)),\"OK\",\"NOK\"))","v":"NOK"},"","",null,"",null,null,null,"",null,"",null,null,null,null,""]
[null,null,null,null,null,null,null,null,"25.144.267/0001-83","NOK","","",null,"",null,null,null,"",null,"",null,null,null,null,""]
[null,null,null,null,null,null,null,null,"25.144.267/0001-83","NOK","","",null,"",null,null,null,"",null,"",null,null,null,null,""]
[null,null,null,null,null,null,null,null,"25.144.267/0001-83","NOK","","",null,"",null,null,null,"",null,"",null,null,null,null,""]
[null,null,null,null,null,null,null,null,"25.144.267/0001-83","NOK","","",null,"",null,null,null,"",null,"",null,null,null,null,""]
[null,null,null,null,null,null,null,null,"25.144.267/0001-83","NOK","","",null,"",null,null,null,"",null,"",null,null,null,null,""]
[null,null,null,null,null,null,null,null,"25.144.267/0001-83","NOK","","",null,"",null,null,null,"",null,"",null,null,null,null,""]
[null,null,null,null,null,null,null,null,"25.144.267/0001-83","NOK","","",null,"",null,null,null,"",null,"",null,null,null,null,""]
[null,null,null,null,null,null,null,null,"25.144.267/0001-83","NOK","","",null,"",null,null,null,"",null,"",null,null,null,null,""]
[null,null,null,null,null,null,null,null,"25.144.267/0001-83","NOK","","",null,"",null,null,null,"",null,"",null,null,null,null,""]
[null,null,null,null,null,null,null,null,"25.144.267/0001-83","NOK","","",null,"",null,null,null,"",null,"",null,null,null,null,""]
[null,null,null,null,null,null,null,null,"25.144.267/0001-83","NOK","","",null,"",null,null,null,"",null,"",null,null,null,null,""]
[null,null,null,null,null,null,null,null,"25.144.267/0001-83","NOK","","",null,"",null,null,null,"",null,"",null,null,null,null,""]
[null,null,null,null,null,null,null,null,"25.144.267/0001-83","NOK","","",null,"",null,null,null,"",null,"",null,null,null,null,""]
[null,null,null,null,null,null,null,null,"25.144.267/0001-83","NOK","","",null,"",null,null,null,"",null,"",null,null,null,null,""]
[null,null,null,null,null,null,null,null,"25.144.267/0001-83","NOK","","",null,"",null,null,null,"",null,"",null,null,null,null,""]
[null,null,null,null,null,null,null,null,"25.144.267/0001-83","NOK","","",null,"",null,null,null,"",null,"",null,null,null,null,""]
[null,null,null,null,null,null,null,null,"25.144.267/0001-83","NOK","","",null,"",null,null,null,"",null,"",null,null,null,null,""]
[null,null,null,null,null,null,null,null,"25.144.267/0001-83","NOK","","",null,"",null,null,null,"",null,"",null,null,null,null,""]
[null,null,null,null,null,null,null,null,"25.144.267/0001-83","NOK","","",null,"",null,null,null,"",null,"",null,null,null,null,""]
[null,null,null,null,null,null,null,null,"25.144.267/0001-83","NOK","","",null,"",null,null,null,"",null,"",null,null,null,null,""]
[null,null,null,null,null,null,null,null,"25.144.267/0001-83","NOK","","",null,"",null,null,null,"",null,"",null,null,null,null,""]
[null,null,null,null,null,null,null,null,"25.144.267/0001-83","NOK","","",null,"",null,null,null,"",null,"",null,null,null,null,""]
[null,null,null,null,null,null,null,null,"25.144.267/0001-83","NOK","","",null,"",null,null,null,"",null,"",null,null,null,null,""]
[null,null,null,null,null,null,null,null,"25.144.267/0001-83","NOK","","",null,"",null,null,null,"",null,"",null,null,null,null,""]
[null,null,null,null,null,null,null,null,"25.144.267/0001-83","NOK","","",null,"",null,null,null,"",null,"",null,null,null,null,""]
[null,null,null,null,null,null,null,null,"25.144.267/0001-83","NOK","","",null,"",null,null,null,"",null,"",null,null,null,null,""]
[null,null,null,null,null,null,null,null,"25.144.267/0001-83","NOK","","",null,"",null,null,null,"",null,"",null,null,null,null,""]
[null,null,null,null,null,null,null,null,"25.144.267/0001-83","NOK","","",null,"",null,null,null,"",null,"",null,null,null,null,""]
[null,null,null,null,null,null,null,null,"25.144.267/0001-83","NOK","","",null,"",null,null,null,"",null,{"$f":"IF(S1137=\"\",\"\",IF(S1137=E1137,\"OK\",\"NOK\"))","v":""},null,null,null,null,""]
[null,null,null,null,null,null,null,null,"25.144.267/0001-83","NOK","","",null,"",null,null,null,"",null,"",null,null,null,null,""]
[null,null,null,null,null,null,null,null,"25.144.267/0001-83","NOK","","",null,"",null,null,null,"",null,"",null,null,null,null,""]
[null,null,null,null,null,null,null,null,"25.144.267/0001-83","NOK","","",null,"",null,null,null,"",null,"",null,null,null,null,""]
[null,null,null,null,null,null,null,null,"25.144.267/0001-83","NOK","","",null,"",null,null,null,"",null,"",null,null,null,null,""]
[null,null,null,null,null,null,null,null,"25.144.267/0001-83","NOK","","",null,"",null,null,null,"",null,"",null,null,null,null,""]
[null,null,null,null,null,null,null,null,"25.144.267/0001-83","NOK","","",null,"",null,null,null,"",null,"",null,null,null,null,""]
[null,null,null,null,null,null,null,null,"25.144.267/0001-83","NOK","","",null,"",null,null,null,"",null,"",null,null,null,null,""]
[null,null,null,null,null,null,null,null,"25.144.267/0001-83","NOK","","",null,"",null,null,null,"",null,"",null,null,null,null,""]
[null,null,null,null,null,null,null,null,"25.144.267/0001-83","NOK","","",null,"",null,null,null,"",null,"",null,null,null,null,""]
[null,null,null,null,null,null,null,null,"25.144.267/0001-83","NOK","","",null,"",null,null,null,{"$f":"IF(Q1147=\"\",\"\",IF(Q1147=D1147,\"OK\",\"NOK\"))","v":""},null,"",null,null,null,null,""]
[null,null,null,null,null,null,null,null,"25.144.267/0001-83","NOK","","",null,"",null,null,null,"",null,"",null,null,null,null,{"$f":"IF(A1148=\"\",\"\",IF(V1148=\"OK\",\"OK\",IF(AND(J1148=\"OK\",L1148=\"OK\",P1148=\"OK\",R1148=\"OK\"),\"OK\",\"NOK\")))","v":""}]
[null,null,null,null,null,null,null,null,"25.144.267/0001-83","NOK","","",null,"",null,null,null,"",null,"",null,null,null,null,""]
[null,null,null,null,null,null,null,null,"25.144.267/0001-83","NOK","","",null,"",null,null,null,"",null,"",null,null,null,null,""]
[null,null,null,null,null,null,null,null,"25.144.267/0001-83","NOK",{"$f":"IF(A1151=\"\",\"\",EDATE(TODAY(),-24))","v":""},"",null,"",null,null,null,"",null,"",null,null,null,null,""]
[null,null,null,null,null,null,null,null,"25.144.267/0001-83","NOK","","",null,"",null,null,null,"",null,"",null,null,null,null,""]
[null,null,null,null,null,null,null,null,"25.144.267/0001-83","NOK","","",null,"",null,null,null,"",null,"",null,null,null,null,""]
[null,null,null,null,null,null,null,null,"25.144.267/0001-83","NOK","","",null,"",null,null,null,"",null,"",null,null,null,null,""]
[null,null,null,null,null,null,null,null,"25.144.267/0001-83","NOK","","",null,"",null,null,null,"",null,"",null,null,null,null,""]
[null,null,null,null,null,null,null,null,"25.144.267/0001-83","NOK","","",null,"",null,null,null,"",null,"",null,null,null,null,""]
[null,null,null,null,null,null,null,null,"25.144.267/0001-83","NOK","","",null,"",null,null,null,"",null,"",null,null,null,null,""]
[null,null,null,null,null,null,null,null,"25.144.267/0001-83","NOK","","",null,"",null,null,null,"",null,"",null,null,null,null,""]
[null,null,null,null,null,null,null,null,"25.144.267/0001-83","NOK","","",null,"",null,null,null,"",null,"",null,null,null,null,""]
[null,null,null,null,null,null,null,null,"25.144.267/0001-83","NOK","","",null,"",null,null,null,"",null,"",null,null,null,null,""]
[null,null,null,null,null,null,null,null,"25.144.267/0001-83","NOK","","",null,"",null,null,null,"",null,"",null,null,null,null,""]
[null,null,null,null,null,null,null,null,"25.144.267/0001-83","NOK","","",null,"",null,null,null,"",null,"",null,null,null,null,""]
[null,null,null,null,null,null,null,null,"25.144.267/0001-83","NOK","","",null,"",null,null,null,"",null,"",null,null,null,null,""]
[null,null,null,null,null,null,null,null,"25.144.267/0001-83","NOK","","",null,"",null,null,null,"",null,"",null,null,null,null,""]
[null,null,null,null,null,null,null,null,"25.144.267/0001-83","NOK","","",null,"",null,null,null,"",null,"",null,null,null,null,""]
[null,null,null,null,null,null,null,null,"25.144.267/0001-83","NOK","","",null,"",null,null,null,"",null,"",null,null,null,null,""]
[null,null,null,null,null,null,null,null,"25.144.267/0001-83","NOK","","",null,"",null,null,null,"",null,"",null,null,null,null,""]
[null,null,null,null,null,null,null,null,"25.144.267/0001-83","NOK","","",null,"",null,null,null,"",null,"",null,null,null,null,""]
[null,null,null,null,null,null,null,null,"25.144.267/0001-83","NOK","","",null,"",null,null,null,"",null,"",null,null,null,null,""]
[null,null,null,null,null,null,null,null,"25.144.267/0001-83","NOK","",{"$f":"IF(G1170=\"\",\"\",IF(G1170>=K1170,\"OK\",\"NOK\"))","v":""},null,"",null,null,null,"",null,"",null,null,null,null,""]
[null,null,null,null,null,null,null,null,"25.144.267/0001-83","NOK","","",null,"",null,null,null,"",null,"",null,null,null,null,""]
[null,null,null,null,null,null,null,null,"25.144.267/0001-83",{"$f":"IF(I1172=\"\",\"\",IF(OR(I1172=H1172,LEFT(H1172,10)=LEFT(I1172,10)),\"OK\",\"NOK\"))","v":"NOK"},"","",null,"",null,null,null,"",null,"",null,null,null,null,""]
[null,null,null,null,null,null,null,null,"25.144.267/0001-83","NOK","","",null,"",null,null,null,"",null,"",null,null,null,null,""]
[null,null,null,null,null,null,null,null,"25.144.267/0001-83","NOK","","",null,"",null,null,null,"",null,"",null,null,null,null,""]
[null,null,null,null,null,null,null,null,"25.144.267/0001-83","NOK","","",null,"",null,null,null,"",null,"",null,null,null,null,""]
[null,null,null,null,null,null,null,null,"25.144.267/0001-83","NOK","","",null,"",null,null,null,"",null,"",null,null,null,null,""]
[null,null,null,null,null,null,null,null,"25.144.267/0001-83","NOK","","",null,"",null,null,null,"",null,"",null,null,null,null,""]
[null,null,null,null,null,null,null,null,"25.144.267/0001-83","NOK","","",null,"",null,null,null,"",null,"",null,null,null,null,""]
[null,null,null,null,null,null,null,null,"25.144.267/0001-83","NOK","","",null,"",null,null,null,"",null,"",null,null,null,null,""]
[null,null,null,null,null,null,null,null,"25.144.267/0001-83","NOK","","",null,"",null,null,null,"",null,"",null,null,null,null,""]
[null,null,null,null,null,null,null,null,"25.144.267/0001-83","NOK","","",null,"",null,null,null,"",null,"",null,null,null,null,""]
[null,null,null,null,null,null,null,null,"25.144.267/0001-83","NOK","","",null,"",null,null,null,"",null,"",null,null,null,null,""]
[null,null,null,null,null,null,null,null,"25.144.267/0001-83","NOK","","",null,"",null,null,null,"",null,"",null,null,null,null,""]
[null,null,null,null,null,null,null,null,"25.144.267/0001-83","NOK","","",null,"",null,null,null,"",null,"",null,null,null,null,""]
[null,null,null,null,null,null,null,null,"25.144.267/0001-83"]
[null,null,null,null,null,null,null,null,"25.144.267/0001-83"]
[null,null,null,null,null,null,null,null,"25.144.267/0001-83"]
[null,null,null,null,null,null,null,null,"25.144.267/0001-83"]

{"sheet":"CNAE","index":2,"n_rows":2401,"n_cols":15,"rows_kept":2401,"cut":false,"hidden":false,"merged":[[0,0,0,5],[2,0,2,4],[0,9,2,14]]}
["Estrutura detalhada da CNAE-Subclasses 2.3\nCódigos (seções, divisões, grupos, classes e subclasses) e denominações",null,null,null,null,null,null,null,null,"PADRONIZA O CARACTER DO CNAE"]
[]
["Códigos"]
["Seção","Divisão","Grupo","Classe","Subclasse","Denominação","PAVARINI ACEITOS",null,null,"A","B","C","D","E","FINAL"]
["A",null,null,null,null,"AGRICULTURA, PECUÁRIA, PRODUÇÃO FLORESTAL, PESCA E AQUICULTURA",null,null,null,{"$f":"LEFT(E5,4)","v":""},{"$f":"CONCATENATE(LEFT(J5,2),\".\",RIGHT(J5,2))","v":"."},{"$f":"RIGHT(E5,4)","v":""},{"$f":"CONCATENATE(\"-\",LEFT(L5,1),\"-\",RIGHT(L5,2))","v":"--"},{"$f":"CONCATENATE(K5,M5)","v":".--"},{"$f":"IF(LEN(N5)=10,N5,\"\")","v":""}]
[null,"01",null,null,null,"AGRICULTURA, PECUÁRIA E SERVIÇOS RELACIONADOS",null,null,null,{"$f":"LEFT(E6,4)","v":""},{"$f":"CONCATENATE(LEFT(J6,2),\".\",RIGHT(J6,2))","v":"."},{"$f":"RIGHT(E6,4)","v":""},{"$f":"CONCATENATE(\"-\",LEFT(L6,1),\"-\",RIGHT(L6,2))","v":"--"},{"$f":"CONCATENATE(K6,M6)","v":".--"},""]
[null,null,"01.1",null,null,"Produção de lavouras temporárias",null,null,null,{"$f":"LEFT(E7,4)","v":""},{"$f":"CONCATENATE(LEFT(J7,2),\".\",RIGHT(J7,2))","v":"."},{"$f":"RIGHT(E7,4)","v":""},{"$f":"CONCATENATE(\"-\",LEFT(L7,1),\"-\",RIGHT(L7,2))","v":"--"},{"$f":"CONCATENATE(K7,M7)","v":".--"},""]
[null,null,null,"01.11-3",null,"Cultivo de cereais",null,null,null,"",".","","--",".--",""]
[null,null,null,null,"01.11-3-01","Cultivo de arroz",null,null,null,"01.1","01..1","3-01","-3-01","01..1-3-01","01..1-3-01"]
[null,null,null,null,"01.11-3-02","Cultivo de milho",null,null,null,"01.1","01..1","3-02","-3-02","01..1-3-02","01..1-3-02"]
[null,null,null,null,"01.11-3-03","Cultivo de trigo",null,null,null,"01.1","01..1","3-03","-3-03","01..1-3-03",{"$f":"IF(LEN(N11)=10,N11,\"\")","v":"01..1-3-03"}]
[null,null,null,null,"01.11-3-99","Cultivo de outros cereais não especificados anteriormente",null,null,null,"01.1","01..1","3-99","-3-99","01..1-3-99","01..1-3-99"]
[null,null,null,"01.12-1","","Cultivo de algodão herbáceo e de outras fibras de lavoura temporária",null,null,null,"",".","","--",".--",""]
[null,null,null,null,"01.12-1-01","Cultivo de algodão herbáceo",null,null,null,"01.1","01..1","1-01","-1-01","01..1-1-01","01..1-1-01"]
[null,null,null,null,"01.12-1-02","Cultivo de juta",null,null,null,"01.1","01..1","1-02","-1-02","01..1-1-02","01..1-1-02"]
[null,null,null,null,"01.12-1-99","Cultivo de outras fibras de lavoura temporária não especificadas anteriormente",null,null,null,"01.1","01..1","1-99","-1-99","01..1-1-99","01..1-1-99"]
[null,null,null,"01.13-0","","Cultivo de cana-de-açúcar",null,null,null,"",".","","--",".--",""]
[null,null,null,null,"01.13-0-00","Cultivo de cana-de-açúcar",null,null,null,"01.1","01..1","0-00","-0-00","01..1-0-00","01..1-0-00"]
[null,null,null,"01.14-8","","Cultivo de fumo",null,null,null,"",".","","--",".--",""]
[null,null,null,null,"01.14-8-00","Cultivo de fumo",null,null,null,"01.1","01..1","8-00","-8-00","01..1-8-00","01..1-8-00"]
[null,null,null,"01.15-6","","Cultivo de soja",null,null,null,"",".","","--",".--",""]
[null,null,null,null,"01.15-6-00","Cultivo de soja",null,null,null,"01.1","01..1","6-00","-6-00","01..1-6-00","01..1-6-00"]
[null,null,null,"01.16-4","","Cultivo de oleaginosas de lavoura temporária, exceto soja",null,null,null,"",".","","--",".--",""]
[null,null,null,null,"01.16-4-01","Cultivo de amendoim",null,null,null,"01.1","01..1","4-01","-4-01","01..1-4-01","01..1-4-01"]
[null,null,null,null,"01.16-4-02","Cultivo de girassol",null,null,null,"01.1","01..1","4-02","-4-02","01..1-4-02","01..1-4-02"]
[null,null,null,null,"01.16-4-03","Cultivo de mamona",null,null,null,"01.1","01..1","4-03","-4-03","01..1-4-03","01..1-4-03"]
[null,null,null,null,"01.16-4-99","Cultivo de outras oleaginosas de lavoura temporária não especificadas anteriormente",null,null,null,"01.1","01..1","4-99","-4-99","01..1-4-99","01..1-4-99"]
[null,null,null,"01.19-9","","Cultivo de plantas de lavoura temporária não especificadas anteriormente",null,null,null,"",".","","--",".--",""]
[null,null,null,null,"01.19-9-01","Cultivo de abacaxi",null,null,null,"01.1","01..1","9-01","-9-01","01..1-9-01","01..1-9-01"]
[null,null,null,null,"01.19-9-02","Cultivo de alho",null,null,null,"01.1","01..1","9-02","-9-02","01..1-9-02","01..1-9-02"]
[null,null,null,null,"01.19-9-03","Cultivo de batata-inglesa",null,null,null,"01.1","01..1","9-03","-9-03","01..1-9-03","01..1-9-03"]
[null,null,null,null,"01.19-9-04","Cultivo de cebola",null,null,null,"01.1","01..1","9-04","-9-04","01..1-9-04","01..1-9-04"]
[null,null,null,null,"01.19-9-05","Cultivo de feijão",null,null,null,"01.1","01..1","9-05","-9-05","01..1-9-05","01..1-9-05"]
[null,null,null,null,"01.19-9-06","Cultivo de mandioca",null,null,null,"01.1","01..1","9-06","-9-06","01..1-9-06","01..1-9-06"]
[null,null,null,null,"01.19-9-07","Cultivo de melão",null,null,null,"01.1","01..1","9-07","-9-07","01..1-9-07","01..1-9-07"]
[null,null,null,null,"01.19-9-08","Cultivo de melancia",null,null,null,"01.1","01..1","9-08","-9-08","01..1-9-08","01..1-9-08"]
[null,null,null,null,"01.19-9-09","Cultivo de tomate rasteiro",null,null,null,"01.1","01..1","9-09","-9-09","01..1-9-09","01..1-9-09"]
[null,null,null,null,"01.19-9-99","Cultivo de outras plantas de lavoura temporária não especificadas anteriormente",null,null,null,"01.1","01..1","9-99","-9-99","01..1-9-99","01..1-9-99"]
[null,null,"01.2",null,"","Horticultura e floricultura",null,null,null,"",".","","--",".--",""]
[null,null,null,"01.21-1","","Horticultura",null,null,null,"",".","","--",".--",""]
[null,null,null,null,"01.21-1-01","Horticultura, exceto morango",null,null,null,"01.2","01..2","1-01","-1-01","01..2-1-01","01..2-1-01"]
[null,null,null,null,"01.21-1-02","Cultivo de morango",null,null,null,"01.2","01..2","1-02","-1-02","01..2-1-02","01..2-1-02"]
[null,null,null,"01.22-9","","Cultivo de flores e plantas ornamentais",null,null,null,"",".","","--",".--",""]
[null,null,null,null,"01.22-9-00","Cultivo de flores e plantas ornamentais",null,null,null,"01.2","01..2","9-00","-9-00","01..2-9-00","01..2-9-00"]
[null,null,"01.3",null,"","Produção de lavouras permanentes",null,null,null,"",".","","--",".--",""]
[null,null,null,"01.31-8","","Cultivo de laranja",null,null,null,"",".","","--",".--",""]
[null,null,null,null,"01.31-8-00","Cultivo de laranja",null,null,null,"01.3","01..3","8-00","-8-00","01..3-8-00","01..3-8-00"]
[null,null,null,"01.32-6","","Cultivo de uva",null,null,null,"",".","","--",".--",""]
[null,null,null,null,"01.32-6-00","Cultivo de uva",null,null,null,"01.3","01..3","6-00","-6-00","01..3-6-00","01..3-6-00"]
[null,null,null,"01.33-4","","Cultivo de frutas de lavoura permanente, exceto laranja e uva",null,null,null,"",".","","--",".--",""]
[null,null,null,null,"01.33-4-01","Cultivo de açaí",null,null,null,"01.3","01..3","4-01","-4-01","01..3-4-01","01..3-4-01"]
[null,null,null,null,"01.33-4-02","Cultivo de banana",null,null,null,"01.3","01..3","4-02","-4-02","01..3-4-02","01..3-4-02"]
[null,null,null,null,"01.33-4-03","Cultivo de caju",null,null,null,"01.3","01..3","4-03","-4-03","01..3-4-03","01..3-4-03"]
[null,null,null,null,"01.33-4-04","Cultivo de cítricos, exceto laranja",null,null,null,"01.3","01..3","4-04","-4-04","01..3-4-04","01..3-4-04"]
[null,null,null,null,"01.33-4-05","Cultivo de coco-da-baía",null,null,null,"01.3","01..3","4-05","-4-05","01..3-4-05","01..3-4-05"]
[null,null,null,null,"01.33-4-06","Cultivo de guaraná",null,null,null,"01.3","01..3","4-06","-4-06","01..3-4-06","01..3-4-06"]
[null,null,null,null,"01.33-4-07","Cultivo de maçã",null,null,null,"01.3","01..3","4-07","-4-07","01..3-4-07","01..3-4-07"]
[null,null,null,null,"01.33-4-08","Cultivo de mamão",null,null,null,"01.3","01..3","4-08","-4-08","01..3-4-08","01..3-4-08"]
[null,null,null,null,"01.33-4-09","Cultivo de maracujá",null,null,null,"01.3","01..3","4-09","-4-09","01..3-4-09","01..3-4-09"]
[null,null,null,null,"01.33-4-10","Cultivo de manga",null,null,null,"01.3","01..3","4-10","-4-10","01..3-4-10","01..3-4-10"]
[null,null,null,null,"01.33-4-11","Cultivo de pêssego",null,null,null,"01.3","01..3","4-11","-4-11","01..3-4-11","01..3-4-11"]
[null,null,null,null,"01.33-4-99","Cultivo de frutas de lavoura permanente não especificadas anteriormente",null,null,null,"01.3","01..3","4-99","-4-99","01..3-4-99","01..3-4-99"]
[null,null,null,"01.34-2","","Cultivo de café",null,null,null,"",".","","--",".--",""]
[null,null,null,null,"01.34-2-00","Cultivo de café",null,null,null,"01.3","01..3","2-00","-2-00","01..3-2-00","01..3-2-00"]
[null,null,null,"01.35-1","","Cultivo de cacau",null,null,null,"",".","","--",".--",""]
[null,null,null,null,"01.35-1-00","Cultivo de cacau",null,null,null,"01.3","01..3","1-00","-1-00","01..3-1-00","01..3-1-00"]
[null,null,null,"01.39-3","","Cultivo de plantas de lavoura permanente não especificadas anteriormente",null,null,null,"",".","","--",".--",""]
[null,null,null,null,"01.39-3-01","Cultivo de chá-da-índia",null,null,null,"01.3","01..3","3-01","-3-01","01..3-3-01","01..3-3-01"]
[null,null,null,null,"01.39-3-02","Cultivo de erva-mate",null,null,null,"01.3","01..3","3-02","-3-02","01..3-3-02","01..3-3-02"]
[null,null,null,null,"01.39-3-03","Cultivo de pimenta-do-reino",null,null,null,"01.3","01..3","3-03","-3-03","01..3-3-03","01..3-3-03"]
[null,null,null,null,"01.39-3-04","Cultivo de plantas para condimento, exceto pimenta-do-reino",null,null,null,{"$f":"LEFT(E71,4)","v":"01.3"},{"$f":"CONCATENATE(LEFT(J71,2),\".\",RIGHT(J71,2))","v":"01..3"},{"$f":"RIGHT(E71,4)","v":"3-04"},{"$f":"CONCATENATE(\"-\",LEFT(L71,1),\"-\",RIGHT(L71,2))","v":"-3-04"},{"$f":"CONCATENATE(K71,M71)","v":"01..3-3-04"},"01..3-3-04"]
[null,null,null,null,"01.39-3-05","Cultivo de dendê",null,null,null,"01.3","01..3","3-05","-3-05","01..3-3-05","01..3-3-05"]
[null,null,null,null,"01.39-3-06","Cultivo de seringueira",null,null,null,"01.3","01..3","3-06","-3-06","01..3-3-06","01..3-3-06"]
[null,null,null,null,"01.39-3-99","Cultivo de outras plantas de lavoura permanente não especificadas anteriormente",null,null,null,"01.3","01..3","3-99","-3-99","01..3-3-99","01..3-3-99"]
[null,null,"01.4",null,"","Produção de sementes e mudas certificadas",null,null,null,"",".","","--",".--",{"$f":"IF(LEN(N75)=10,N75,\"\")","v":""}]
[null,null,null,"01.41-5","","Produção de sementes certificadas",null,null,null,"",".","","--",".--",""]
[null,null,null,null,"01.41-5-01","Produção de sementes certificadas, exceto de forrageiras para pasto",null,null,null,"01.4","01..4","5-01","-5-01","01..4-5-01","01..4-5-01"]
[null,null,null,null,"01.41-5-02","Produção de sementes certificadas de forrageiras para formação de pasto",null,null,null,"01.4","01..4","5-02","-5-02","01..4-5-02","01..4-5-02"]
[null,null,null,"01.42-3","","Produção de mudas e outras formas de propagação vegetal, certificadas",null,null,null,"",".","","--",".--",""]
[null,null,null,null,"01.42-3-00","Produção de mudas e outras formas de propagação vegetal, certificadas",null,null,null,"01.4","01..4","3-00","-3-00","01..4-3-00","01..4-3-00"]
[null,null,"01.5",null,"","Pecuária",null,null,null,"",".","","--",".--",""]
[null,null,null,"01.51-2","","Criação de bovinos",null,null,null,"",".","","--",".--",""]
[null,null,null,null,"01.51-2-01","Criação de bovinos para corte",null,null,null,"01.5","01..5","2-01","-2-01","01..5-2-01","01..5-2-01"]
[null,null,null,null,"01.51-2-02","Criação de bovinos para leite",null,null,null,"01.5","01..5","2-02","-2-02","01..5-2-02","01..5-2-02"]
[null,null,null,null,"01.51-2-03","Criação de bovinos, exceto para corte e leite",null,null,null,"01.5","01..5","2-03","-2-03","01..5-2-03","01..5-2-03"]
[null,null,null,"01.52-1","","Criação de outros animais de grande porte",null,null,null,"",".","","--",".--",""]
[null,null,null,null,"01.52-1-01","Criação de bufalinos",null,null,null,"01.5","01..5","1-01","-1-01","01..5-1-01","01..5-1-01"]
[null,null,null,null,"01.52-1-02","Criação de equinos",null,null,null,"01.5","01..5","1-02","-1-02","01..5-1-02","01..5-1-02"]
[null,null,null,null,"01.52-1-03","Criação de asininos e muares",null,null,null,"01.5","01..5","1-03","-1-03","01..5-1-03","01..5-1-03"]
[null,null,null,"01.53-9","","Criação de caprinos e ovinos",null,null,null,"",".","","--",".--",""]
[null,null,null,null,"01.53-9-01","Criação de caprinos",null,null,null,"01.5","01..5","9-01","-9-01","01..5-9-01","01..5-9-01"]
[null,null,null,null,"01.53-9-02","Criação de ovinos, inclusive para produção de lã",null,null,null,"01.5","01..5","9-02","-9-02","01..5-9-02","01..5-9-02"]
[null,null,null,"01.54-7","","Criação de suínos",null,null,null,"",".","","--",".--",""]
[null,null,null,null,"01.54-7-00","Criação de suínos",null,null,null,"01.5","01..5","7-00","-7-00","01..5-7-00","01..5-7-00"]
[null,null,null,"01.55-5","","Criação de aves",null,null,null,"",".","","--",".--",""]
[null,null,null,null,"01.55-5-01","Criação de frangos para corte",null,null,null,"01.5","01..5","5-01","-5-01","01..5-5-01","01..5-5-01"]
[null,null,null,null,"01.55-5-02","Produção de pintos de um dia",null,null,null,"01.5","01..5","5-02","-5-02","01..5-5-02","01..5-5-02"]
[null,null,null,null,"01.55-5-03","Criação de outros galináceos, exceto para corte",null,null,null,"01.5","01..5","5-03","-5-03","01..5-5-03","01..5-5-03"]
[null,null,null,null,"01.55-5-04","Criação de aves, exceto galináceos",null,null,null,"01.5","01..5","5-04","-5-04","01..5-5-04","01..5-5-04"]
[null,null,null,null,"01.55-5-05","Produção de ovos",null,null,null,"01.5","01..5","5-05","-5-05","01..5-5-05","01..5-5-05"]
[null,null,null,"01.59-8","","Criação de animais não especificados anteriormente",null,null,null,"",".","","--",".--",""]
[null,null,null,null,"01.59-8-01","Apicultura",null,null,null,"01.5","01..5","8-01","-8-01","01..5-8-01","01..5-8-01"]
[null,null,null,null,"01.59-8-02","Criação de animais de estimação",null,null,null,"01.5","01..5","8-02","-8-02","01..5-8-02","01..5-8-02"]
[null,null,null,null,"01.59-8-03","Criação de escargô",null,null,null,"01.5","01..5","8-03","-8-03","01..5-8-03","01..5-8-03"]
[null,null,null,null,"01.59-8-04","Criação de bicho-da-seda",null,null,null,"01.5","01..5","8-04","-8-04","01..5-8-04","01..5-8-04"]
[null,null,null,null,"01.59-8-99","Criação de outros animais não especificados anteriormente",null,null,null,"01.5","01..5","8-99","-8-99","01..5-8-99","01..5-8-99"]
[null,null,"01.6",null,"","Atividades de apoio à agricultura e à pecuária; atividades de\npós-colheita",null,null,null,"",".","","--",".--",""]
[null,null,null,"01.61-0","","Atividades de apoio à agricultura",null,null,null,"",".","","--",".--",""]
[null,null,null,null,"01.61-0-01","Serviço de pulverização e controle de pragas agrícolas",null,null,null,"01.6","01..6","0-01","-0-01","01..6-0-01","01..6-0-01"]
[null,null,null,null,"01.61-0-02","Serviço de poda de árvores para lavouras",null,null,null,"01.6","01..6","0-02","-0-02","01..6-0-02","01..6-0-02"]
[null,null,null,null,"01.61-0-03","Serviço de preparação de terreno, cultivo e colheita",null,null,null,"01.6","01..6","0-03","-0-03","01..6-0-03","01..6-0-03"]
[null,null,null,null,"01.61-0-99","Atividades de apoio à agricultura não especificadas anteriormente",null,null,null,"01.6","01..6","0-99","-0-99","01..6-0-99","01..6-0-99"]
[null,null,null,"01.62-8","","Atividades de apoio à pecuária",null,null,null,"",".","","--",".--",""]
[null,null,null,null,"01.62-8-01","Serviço de inseminação artificial em animais",null,null,null,"01.6","01..6","8-01","-8-01","01..6-8-01","01..6-8-01"]
[null,null,null,null,"01.62-8-02","Serviço de tosquiamento de ovinos",null,null,null,"01.6","01..6","8-02","-8-02","01..6-8-02","01..6-8-02"]
[null,null,null,null,"01.62-8-03","Serviço de manejo de animais",null,null,null,"01.6","01..6","8-03","-8-03","01..6-8-03","01..6-8-03"]
[null,null,null,null,"01.62-8-99","Atividades de apoio à pecuária não especificadas anteriormente",null,null,null,"01.6","01..6","8-99","-8-99","01..6-8-99","01..6-8-99"]
[null,null,null,"01.63-6","","Atividades de pós-colheita",null,null,null,"",".","","--",".--",""]
[null,null,null,null,"01.63-6-00","Atividades de pós-colheita",null,null,null,"01.6","01..6","6-00","-6-00","01..6-6-00","01..6-6-00"]
[null,null,"01.7",null,"","Caça e serviços relacionados",null,null,null,"",".","","--",".--",""]
[null,null,null,"01.70-9","","Caça e serviços relacionados",null,null,null,"",".","","--",".--",""]
[null,null,null,null,"01.70-9-00","Caça e serviços relacionados",null,null,null,"01.7","01..7","9-00","-9-00","01..7-9-00","01..7-9-00"]
[null,"02",null,null,"","PRODUÇÃO FLORESTAL",null,null,null,"",".","","--",".--",""]
[null,null,"02.1",null,"","Produção florestal - florestas plantadas",null,null,null,"",".","","--",".--",""]
[null,null,null,"02.10-1","","Produção florestal - florestas plantadas",null,null,null,"",".","","--",".--",""]
[null,null,null,null,"02.10-1-01","Cultivo de eucalipto",null,null,null,"02.1","02..1","1-01","-1-01","02..1-1-01","02..1-1-01"]
[null,null,null,null,"02.10-1-02","Cultivo de acácia-negra",null,null,null,"02.1","02..1","1-02","-1-02","02..1-1-02","02..1-1-02"]
[null,null,null,null,"02.10-1-03","Cultivo de pinus",null,null,null,"02.1","02..1","1-03","-1-03","02..1-1-03","02..1-1-03"]
[null,null,null,null,"02.10-1-04","Cultivo de teca",null,null,null,"02.1","02..1","1-04","-1-04","02..1-1-04","02..1-1-04"]
[null,null,null,null,"02.10-1-05","Cultivo de espécies madeireiras, exceto eucalipto, acácia-negra, pinus e teca",null,null,null,"02.1","02..1","1-05","-1-05","02..1-1-05","02..1-1-05"]
[null,null,null,null,"02.10-1-06","Cultivo de mudas em viveiros florestais",null,null,null,"02.1","02..1","1-06","-1-06","02..1-1-06","02..1-1-06"]
[null,null,null,null,"02.10-1-07","Extração de madeira em florestas plantadas",null,null,null,"02.1","02..1","1-07","-1-07","02..1-1-07","02..1-1-07"]
[null,null,null,null,"02.10-1-08","Produção de carvão vegetal - florestas plantadas",null,null,null,"02.1","02..1","1-08","-1-08","02..1-1-08","02..1-1-08"]
[null,null,null,null,"02.10-1-09","Produção de casca de acácia-negra - florestas plantadas",null,null,null,"02.1","02..1","1-09","-1-09","02..1-1-09","02..1-1-09"]
[null,null,null,null,"02.10-1-99","Produção de produtos não madeireiros não especificados anteriormente em florestas plantadas",null,null,null,{"$f":"LEFT(E135,4)","v":"02.1"},{"$f":"CONCATENATE(LEFT(J135,2),\".\",RIGHT(J135,2))","v":"02..1"},{"$f":"RIGHT(E135,4)","v":"1-99"},{"$f":"CONCATENATE(\"-\",LEFT(L135,1),\"-\",RIGHT(L135,2))","v":"-1-99"},{"$f":"CONCATENATE(K135,M135)","v":"02..1-1-99"},"02..1-1-99"]
[null,null,"02.2",null,"","Produção florestal - florestas nativas",null,null,null,"",".","","--",".--",""]
[null,null,null,"02.20-9","","Produção florestal - florestas nativas",null,null,null,"",".","","--",".--",""]
[null,null,null,null,"02.20-9-01","Extração de madeira em florestas nativas",null,null,null,"02.2","02..2","9-01","-9-01","02..2-9-01","02..2-9-01"]
[null,null,null,null,"02.20-9-02","Produção de carvão vegetal - florestas nativas",null,null,null,"02.2","02..2","9-02","-9-02","02..2-9-02",{"$f":"IF(LEN(N139)=10,N139,\"\")","v":"02..2-9-02"}]
[null,null,null,null,"02.20-9-03","Coleta de castanha-do-pará em florestas nativas",null,null,null,"02.2","02..2","9-03","-9-03","02..2-9-03","02..2-9-03"]
[null,null,null,null,"02.20-9-04","Coleta de látex em florestas nativas",null,null,null,"02.2","02..2","9-04","-9-04","02..2-9-04","02..2-9-04"]
[null,null,null,null,"02.20-9-05","Coleta de palmito em florestas nativas",null,null,null,"02.2","02..2","9-05","-9-05","02..2-9-05","02..2-9-05"]
[null,null,null,null,"02.20-9-06","Conservação de florestas nativas",null,null,null,"02.2","02..2","9-06","-9-06","02..2-9-06","02..2-9-06"]
[null,null,null,null,"02.20-9-99","Coleta de produtos não madeireiros não especificados anteriormente em florestas nativas",null,null,null,"02.2","02..2","9-99","-9-99","02..2-9-99","02..2-9-99"]
[null,null,"02.3",null,"","Atividades de apoio à produção florestal",null,null,null,"",".","","--",".--",""]
[null,null,null,"02.30-6","","Atividades de apoio à produção florestal",null,null,null,"",".","","--",".--",""]
[null,null,null,null,"02.30-6-00","Atividades de apoio à produção florestal",null,null,null,"02.3","02..3","6-00","-6-00","02..3-6-00","02..3-6-00"]
[null,"03",null,null,"","PESCA E AQÜICULTURA",null,null,null,"",".","","--",".--",""]
[null,null,"03.1",null,"","Pesca",null,null,null,"",".","","--",".--",""]
[null,null,null,"03.11-6","","Pesca em água salgada",null,null,null,"",".","","--",".--",""]
[null,null,null,null,"03.11-6-01","Pesca de peixes em água salgada",null,null,null,"03.1","03..1","6-01","-6-01","03..1-6-01","03..1-6-01"]
[null,null,null,null,"03.11-6-02","Pesca de crustáceos e moluscos em água salgada",null,null,null,"03.1","03..1","6-02","-6-02","03..1-6-02","03..1-6-02"]
[null,null,null,null,"03.11-6-03","Coleta de outros produtos marinhos",null,null,null,"03.1","03..1","6-03","-6-03","03..1-6-03","03..1-6-03"]
[null,null,null,null,"03.11-6-04","Atividades de apoio à pesca em água salgada",null,null,null,"03.1","03..1","6-04","-6-04","03..1-6-04","03..1-6-04"]
[null,null,null,"03.12-4","","Pesca em água doce",null,null,null,"",".","","--",".--",""]
[null,null,null,null,"03.12-4-01","Pesca de peixes em água doce",null,null,null,"03.1","03..1","4-01","-4-01","03..1-4-01","03..1-4-01"]
[null,null,null,null,"03.12-4-02","Pesca de crustáceos e moluscos em água doce",null,null,null,"03.1","03..1","4-02","-4-02","03..1-4-02","03..1-4-02"]
[null,null,null,null,"03.12-4-03","Coleta de outros produtos aquáticos de água doce",null,null,null,"03.1","03..1","4-03","-4-03","03..1-4-03","03..1-4-03"]
[null,null,null,null,"03.12-4-04","Atividades de apoio à pesca em água doce",null,null,null,"03.1","03..1","4-04","-4-04","03..1-4-04","03..1-4-04"]
[null,null,"03.2",null,"","Aquicultura",null,null,null,"",".","","--",".--",""]
[null,null,null,"03.21-3","","Aquicultura em água salgada e salobra",null,null,null,"",".","","--",".--",""]
[null,null,null,null,"03.21-3-01","Criação de peixes em água salgada e salobra",null,null,null,"03.2","03..2","3-01","-3-01","03..2-3-01","03..2-3-01"]
[null,null,null,null,"03.21-3-02","Criação de camarões em água salgada e salobra",null,null,null,"03.2","03..2","3-02","-3-02","03..2-3-02","03..2-3-02"]
[null,null,null,null,"03.21-3-03","Criação de ostras e mexilhões em água salgada e salobra",null,null,null,"03.2","03..2","3-03","-3-03","03..2-3-03","03..2-3-03"]
[null,null,null,null,"03.21-3-04","Criação de peixes ornamentais em água salgada e salobra",null,null,null,"03.2","03..2","3-04","-3-04","03..2-3-04","03..2-3-04"]
[null,null,null,null,"03.21-3-05","Atividades de apoio à aquicultura em água salgada e salobra",null,null,null,"03.2","03..2","3-05","-3-05","03..2-3-05","03..2-3-05"]
[null,null,null,null,"03.21-3-99","Cultivos e semicultivos da aquicultura em água salgada e salobra não especificados anteriormente",null,null,null,"03.2","03..2","3-99","-3-99","03..2-3-99","03..2-3-99"]
[null,null,null,"03.22-1","","Aquicultura em água doce",null,null,null,"",".","","--",".--",""]
[null,null,null,null,"03.22-1-01","Criação de peixes em água doce",null,null,null,"03.2","03..2","1-01","-1-01","03..2-1-01","03..2-1-01"]
[null,null,null,null,"03.22-1-02","Criação de camarões em água doce",null,null,null,"03.2","03..2","1-02","-1-02","03..2-1-02","03..2-1-02"]
[null,null,null,null,"03.22-1-03","Criação de ostras e mexilhões em água doce",null,null,null,"03.2","03..2","1-03","-1-03","03..2-1-03","03..2-1-03"]
[null,null,null,null,"03.22-1-04","Criação de peixes ornamentais em água doce",null,null,null,"03.2","03..2","1-04","-1-04","03..2-1-04","03..2-1-04"]
[null,null,null,null,"03.22-1-05","Ranicultura",null,null,null,"03.2","03..2","1-05","-1-05","03..2-1-05","03..2-1-05"]
[null,null,null,null,"03.22-1-06","Criação de jacaré",null,null,null,"03.2","03..2","1-06","-1-06","03..2-1-06","03..2-1-06"]
[null,null,null,null,"03.22-1-07","Atividades de apoio à aquicultura em água doce",null,null,null,"03.2","03..2","1-07","-1-07","03..2-1-07","03..2-1-07"]
[null,null,null,null,"03.22-1-99","Cultivos e semicultivos da aquicultura em água doce não especificados anteriormente",null,null,null,"03.2","03..2","1-99","-1-99","03..2-1-99","03..2-1-99"]
["B",null,null,null,"","INDÚSTRIAS EXTRATIVAS",null,null,null,"",".","","--",".--",""]
[null,"05",null,null,"","EXTRAÇÃO DE CARVÃO MINERAL",null,null,null,"",".","","--",".--",""]
[null,null,"05.0",null,"","Extração de carvão mineral",null,null,null,"",".","","--",".--",""]
[null,null,null,"05.00-3","","Extração de carvão mineral",null,null,null,"",".","","--",".--",""]
[null,null,null,null,"05.00-3-01","Extração de carvão mineral",null,null,null,"05.0","05..0","3-01","-3-01","05..0-3-01","05..0-3-01"]
[null,null,null,null,"05.00-3-02","Beneficiamento de carvão mineral",null,null,null,"05.0","05..0","3-02","-3-02","05..0-3-02","05..0-3-02"]
[null,"06",null,null,"","EXTRAÇÃO DE PETRÓLEO E GÁS NATURAL",null,null,null,"",".","","--",".--",""]
[null,null,"06.0",null,"","Extração de petróleo e gás natural",null,null,null,"",".","","--",".--",""]
[null,null,null,"06.00-0","","Extração de petróleo e gás natural",null,null,null,"",".","","--",".--",""]
[null,null,null,null,"06.00-0-01","Extração de petróleo e gás natural",null,null,null,"06.0","06..0","0-01","-0-01","06..0-0-01","06..0-0-01"]
[null,null,null,null,"06.00-0-02","Extração e beneficiamento de xisto",null,null,null,"06.0","06..0","0-02","-0-02","06..0-0-02","06..0-0-02"]
[null,null,null,null,"06.00-0-03","Extração e beneficiamento de areias betuminosas",null,null,null,"06.0","06..0","0-03","-0-03","06..0-0-03","06..0-0-03"]
[null,"07",null,null,"","EXTRAÇÃO DE MINERAIS METÁLICOS",null,null,null,"",".","","--",".--",""]
[null,null,"07.1",null,"","Extração de minério de ferro",null,null,null,"",".","","--",".--",""]
[null,null,null,"07.10-3","","Extração de minério de ferro",null,null,null,"",".","","--",".--",""]
[null,null,null,null,"07.10-3-01","Extração de minério de ferro",null,null,null,"07.1","07..1","3-01","-3-01","07..1-3-01","07..1-3-01"]
[null,null,null,null,"07.10-3-02","Pelotização, sinterização e outros beneficiamentos de minério de ferro",null,null,null,"07.1","07..1","3-02","-3-02","07..1-3-02","07..1-3-02"]
[null,null,"07.2",null,"","Extração de minerais metálicos não ferrosos",null,null,null,"",".","","--",".--",""]
[null,null,null,"07.21-9","","Extração de minério de alumínio",null,null,null,"",".","","--",".--",""]
[null,null,null,null,"07.21-9-01","Extração de minério de alumínio",null,null,null,"07.2","07..2","9-01","-9-01","07..2-9-01","07..2-9-01"]
[null,null,null,null,"07.21-9-02","Beneficiamento de minério de alumínio",null,null,null,"07.2","07..2","9-02","-9-02","07..2-9-02","07..2-9-02"]
[null,null,null,"07.22-7","","Extração de minério de estanho",null,null,null,"",".","","--",".--",""]
[null,null,null,null,"07.22-7-01","Extração de minério de estanho",null,null,null,{"$f":"LEFT(E199,4)","v":"07.2"},{"$f":"CONCATENATE(LEFT(J199,2),\".\",RIGHT(J199,2))","v":"07..2"},{"$f":"RIGHT(E199,4)","v":"7-01"},{"$f":"CONCATENATE(\"-\",LEFT(L199,1),\"-\",RIGHT(L199,2))","v":"-7-01"},{"$f":"CONCATENATE(K199,M199)","v":"07..2-7-01"},"07..2-7-01"]
[null,null,null,null,"07.22-7-02","Beneficiamento de minério de estanho",null,null,null,"07.2","07..2","7-02","-7-02","07..2-7-02","07..2-7-02"]
[null,null,null,"07.23-5","","Extração de minério de manganês",null,null,null,"",".","","--",".--",""]
[null,null,null,null,"07.23-5-01","Extração de minério de manganês",null,null,null,"07.2","07..2","5-01","-5-01","07..2-5-01","07..2-5-01"]
[null,null,null,null,"07.23-5-02","Beneficiamento de minério de manganês",null,null,null,"07.2","07..2","5-02","-5-02","07..2-5-02",{"$f":"IF(LEN(N203)=10,N203,\"\")","v":"07..2-5-02"}]
[null,null,null,"07.24-3","","Extração de minério de metais preciosos",null,null,null,"",".","","--",".--",""]
[null,null,null,null,"07.24-3-01","Extração de minério de metais preciosos",null,null,null,"07.2","07..2","3-01","-3-01","07..2-3-01","07..2-3-01"]
[null,null,null,null,"07.24-3-02","Beneficiamento de minério de metais preciosos",null,null,null,"07.2","07..2","3-02","-3-02","07..2-3-02","07..2-3-02"]
[null,null,null,"07.25-1","","Extração de minerais radioativos",null,null,null,"",".","","--",".--",""]
[null,null,null,null,"07.25-1-00","Extração de minerais radioativos",null,null,null,"07.2","07..2","1-00","-1-00","07..2-1-00","07..2-1-00"]
[null,null,null,"07.29-4","","Extração de minerais metálicos não ferrosos não especificados anteriormente",null,null,null,"",".","","--",".--",""]
[null,null,null,null,"07.29-4-01","Extração de minérios de nióbio e titânio",null,null,null,"07.2","07..2","4-01","-4-01","07..2-4-01","07..2-4-01"]
[null,null,null,null,"07.29-4-02","Extração de minério de tungstênio",null,null,null,"07.2","07..2","4-02","-4-02","07..2-4-02","07..2-4-02"]
[null,null,null,null,"07.29-4-03","Extração de minério de níquel",null,null,null,"07.2","07..2","4-03","-4-03","07..2-4-03","07..2-4-03"]
[null,null,null,null,"07.29-4-04","Extração de minérios de cobre, chumbo, zinco e outros minerais metálicos não ferrosos não especificados anteriormente",null,null,null,"07.2","07..2","4-04","-4-04","07..2-4-04","07..2-4-04"]
[null,null,null,null,"07.29-4-05","Beneficiamento de minérios de cobre, chumbo, zinco e outros minerais metálicos não ferrosos não especificados anteriormente",null,null,null,"07.2","07..2","4-05","-4-05","07..2-4-05","07..2-4-05"]
[null,"08",null,null,"","EXTRAÇÃO DE MINERAIS NÃO METÁLICOS",null,null,null,"",".","","--",".--",""]
[null,null,"08.1",null,"","Extração de pedra, areia e argila",null,null,null,"",".","","--",".--",""]
[null,null,null,"08.10-0","","Extração de pedra, areia e argila",null,null,null,"",".","","--",".--",""]
[null,null,null,null,"08.10-0-01","Extração de ardósia e beneficiamento associado",null,null,null,"08.1","08..1","0-01","-0-01","08..1-0-01","08..1-0-01"]
[null,null,null,null,"08.10-0-02","Extração de granito e beneficiamento associado",null,null,null,"08.1","08..1","0-02","-0-02","08..1-0-02","08..1-0-02"]
[null,null,null,null,"08.10-0-03","Extração de mármore e beneficiamento associado",null,null,null,"08.1","08..1","0-03","-0-03","08..1-0-03","08..1-0-03"]
[null,null,null,null,"08.10-0-04","Extração de calcário e dolomita e beneficiamento associado",null,null,null,"08.1","08..1","0-04","-0-04","08..1-0-04","08..1-0-04"]
[null,null,null,null,"08.10-0-05","Extração de gesso e caulim",null,null,null,"08.1","08..1","0-05","-0-05","08..1-0-05","08..1-0-05"]
[null,null,null,null,"08.10-0-06","Extração de areia, cascalho ou pedregulho e beneficiamento associado",null,null,null,"08.1","08..1","0-06","-0-06","08..1-0-06","08..1-0-06"]
[null,null,null,null,"08.10-0-07","Extração de argila e beneficiamento associado",null,null,null,"08.1","08..1","0-07","-0-07","08..1-0-07","08..1-0-07"]
[null,null,null,null,"08.10-0-08","Extração de saibro e beneficiamento associado",null,null,null,"08.1","08..1","0-08","-0-08","08..1-0-08","08..1-0-08"]
[null,null,null,null,"08.10-0-09","Extração de basalto e beneficiamento associado",null,null,null,"08.1","08..1","0-09","-0-09","08..1-0-09","08..1-0-09"]
[null,null,null,null,"08.10-0-10","Beneficiamento de gesso e caulim associado à extração",null,null,null,"08.1","08..1","0-10","-0-10","08..1-0-10","08..1-0-10"]
[null,null,null,null,"08.10-0-99","Extração e britamento de pedras e outros materiais para construção e beneficiamento associado","SIM",null,null,"08.1","08..1","0-99","-0-99","08..1-0-99","08..1-0-99"]
[null,null,"08.9",null,"","Extração de outros minerais não metálicos",null,null,null,"",".","","--",".--",""]
[null,null,null,"08.91-6","","Extração de minerais para fabricação de adubos, fertilizantes e outros produtos químicos",null,null,null,"",".","","--",".--",""]
[null,null,null,null,"08.91-6-00","Extração de minerais para fabricação de adubos, fertilizantes e outros produtos químicos",null,null,null,"08.9","08..9","6-00","-6-00","08..9-6-00","08..9-6-00"]
[null,null,null,"08.92-4","","Extração e refino de sal marinho e sal-gema",null,null,null,"",".","","--",".--",""]
[null,null,null,null,"08.92-4-01","Extração de sal marinho",null,null,null,"08.9","08..9","4-01","-4-01","08..9-4-01","08..9-4-01"]
[null,null,null,null,"08.92-4-02","Extração de sal-gema",null,null,null,"08.9","08..9","4-02","-4-02","08..9-4-02","08..9-4-02"]
[null,null,null,null,"08.92-4-03","Refino e outros tratamentos do sal",null,null,null,"08.9","08..9","4-03","-4-03","08..9-4-03","08..9-4-03"]
[null,null,null,"08.93-2","","Extração de gemas (pedras preciosas e semipreciosas)",null,null,null,"",".","","--",".--",""]
[null,null,null,null,"08.93-2-00","Extração de gemas (pedras preciosas e semipreciosas)",null,null,null,"08.9","08..9","2-00","-2-00","08..9-2-00","08..9-2-00"]
[null,null,null,"08.99-1","","Extração de minerais não metálicos não especificados anteriormente",null,null,null,"",".","","--",".--",""]
[null,null,null,null,"08.99-1-01","Extração de grafita",null,null,null,"08.9","08..9","1-01","-1-01","08..9-1-01","08..9-1-01"]
[null,null,null,null,"08.99-1-02","Extração de quartzo",null,null,null,"08.9","08..9","1-02","-1-02","08..9-1-02","08..9-1-02"]
[null,null,null,null,"08.99-1-03","Extração de amianto",null,null,null,"08.9","08..9","1-03","-1-03","08..9-1-03","08..9-1-03"]
[null,null,null,null,"08.99-1-99","Extração de outros minerais não metálicos não especificados anteriormente",null,null,null,"08.9","08..9","1-99","-1-99","08..9-1-99","08..9-1-99"]
[null,"09",null,null,"","ATIVIDADES DE APOIO À EXTRAÇÃO DE MINERAIS",null,null,null,"",".","","--",".--",""]
[null,null,"09.1",null,"","Atividades de apoio à extração de petróleo e gás natural",null,null,null,"",".","","--",".--",""]
[null,null,null,"09.10-6","","Atividades de apoio à extração de petróleo e gás natural",null,null,null,"",".","","--",".--",""]
[null,null,null,null,"09.10-6-00","Atividades de apoio à extração de petróleo e gás natural",null,null,null,"09.1","09..1","6-00","-6-00","09..1-6-00","09..1-6-00"]
[null,null,"09.9",null,"","Atividades de apoio à extração de minerais, exceto petróleo e gás natural",null,null,null,"",".","","--",".--",""]
[null,null,null,"09.90-4","","Atividades de apoio à extração de minerais, exceto petróleo e gás natural",null,null,null,"",".","","--",".--",""]
[null,null,null,null,"09.90-4-01","Atividades de apoio à extração de minério de ferro",null,null,null,"09.9","09..9","4-01","-4-01","09..9-4-01","09..9-4-01"]
[null,null,null,null,"09.90-4-02","Atividades de apoio à extração de minerais metálicos não ferrosos",null,null,null,"09.9","09..9","4-02","-4-02","09..9-4-02","09..9-4-02"]
[null,null,null,null,"09.90-4-03","Atividades de apoio à extração de minerais não metálicos",null,null,null,"09.9","09..9","4-03","-4-03","09..9-4-03","09..9-4-03"]
["C",null,null,null,"","INDÚSTRIAS DE TRANSFORMAÇÃO",null,null,null,"",".","","--",".--",""]
[null,"10",null,null,"","FABRICAÇÃO DE PRODUTOS ALIMENTÍCIOS",null,null,null,"",".","","--",".--",""]
[null,null,"10.1",null,"","Abate e fabricação de produtos de carne",null,null,null,"",".","","--",".--",""]
[null,null,null,"10.11-2","","Abate de reses, exceto suínos",null,null,null,"",".","","--",".--",""]
[null,null,null,null,"10.11-2-01","Frigorífico - abate de bovinos",null,null,null,"10.1","10..1","2-01","-2-01","10..1-2-01","10..1-2-01"]
[null,null,null,null,"10.11-2-02","Frigorífico - abate de equinos",null,null,null,"10.1","10..1","2-02","-2-02","10..1-2-02","10..1-2-02"]
[null,null,null,null,"10.11-2-03","Frigorífico - abate de ovinos e caprinos",null,null,null,"10.1","10..1","2-03","-2-03","10..1-2-03","10..1-2-03"]
[null,null,null,null,"10.11-2-04","Frigorífico - abate de bufalinos",null,null,null,"10.1","10..1","2-04","-2-04","10..1-2-04","10..1-2-04"]
[null,null,null,null,"10.11-2-05","Matadouro - abate de reses sob contrato, exceto abate de suínos",null,null,null,"10.1","10..1","2-05","-2-05","10..1-2-05","10..1-2-05"]
[null,null,null,"10.12-1","","Abate de suínos, aves e outros pequenos animais",null,null,null,"",".","","--",".--",""]
[null,null,null,null,"10.12-1-01","Abate de aves",null,null,null,"10.1","10..1","1-01","-1-01","10..1-1-01","10..1-1-01"]
[null,null,null,null,"10.12-1-02","Abate de pequenos animais",null,null,null,{"$f":"LEFT(E263,4)","v":"10.1"},{"$f":"CONCATENATE(LEFT(J263,2),\".\",RIGHT(J263,2))","v":"10..1"},{"$f":"RIGHT(E263,4)","v":"1-02"},{"$f":"CONCATENATE(\"-\",LEFT(L263,1),\"-\",RIGHT(L263,2))","v":"-1-02"},{"$f":"CONCATENATE(K263,M263)","v":"10..1-1-02"},"10..1-1-02"]
[null,null,null,null,"10.12-1-03","Frigorífico - abate de suínos",null,null,null,"10.1","10..1","1-03","-1-03","10..1-1-03","10..1-1-03"]
[null,null,null,null,"10.12-1-04","Matadouro - abate de suínos sob contrato",null,null,null,"10.1","10..1","1-04","-1-04","10..1-1-04","10..1-1-04"]
[null,null,null,"10.13-9","","Fabricação de produtos de carne",null,null,null,"",".","","--",".--",""]
[null,null,null,null,"10.13-9-01","Fabricação de produtos de carne",null,null,null,"10.1","10..1","9-01","-9-01","10..1-9-01",{"$f":"IF(LEN(N267)=10,N267,\"\")","v":"10..1-9-01"}]
[null,null,null,null,"10.13-9-02","Preparação de subprodutos do abate",null,null,null,"10.1","10..1","9-02","-9-02","10..1-9-02","10..1-9-02"]
[null,null,"10.2",null,"","Preservação do pescado e fabricação de produtos do pescado",null,null,null,"",".","","--",".--",""]
[null,null,null,"10.20-1","","Preservação do pescado e fabricação de produtos do pescado",null,null,null,"",".","","--",".--",""]
[null,null,null,null,"10.20-1-01","Preservação de peixes, crustáceos e moluscos",null,null,null,"10.2","10..2","1-01","-1-01","10..2-1-01","10..2-1-01"]
[null,null,null,null,"10.20-1-02","Fabricação de conservas de peixes, crustáceos e moluscos",null,null,null,"10.2","10..2","1-02","-1-02","10..2-1-02","10..2-1-02"]
[null,null,"10.3",null,"","Fabricação de conservas de frutas, legumes e outros vegetais",null,null,null,"",".","","--",".--",""]
[null,null,null,"10.31-7","","Fabricação de conservas de frutas",null,null,null,"",".","","--",".--",""]
[null,null,null,null,"10.31-7-00","Fabricação de conservas de frutas",null,null,null,"10.3","10..3","7-00","-7-00","10..3-7-00","10..3-7-00"]
[null,null,null,"10.32-5","","Fabricação de conservas de legumes e outros vegetais",null,null,null,"",".","","--",".--",""]
[null,null,null,null,"10.32-5-01","Fabricação de conservas de palmito",null,null,null,"10.3","10..3","5-01","-5-01","10..3-5-01","10..3-5-01"]
[null,null,null,null,"10.32-5-99","Fabricação de conservas de legumes e outros vegetais, exceto palmito",null,null,null,"10.3","10..3","5-99","-5-99","10..3-5-99","10..3-5-99"]
[null,null,null,"10.33-3","","Fabricação de sucos de frutas, hortaliças e legumes",null,null,null,"",".","","--",".--",""]
[null,null,null,null,"10.33-3-01","Fabricação de sucos concentrados de frutas, hortaliças e legumes",null,null,null,"10.3","10..3","3-01","-3-01","10..3-3-01","10..3-3-01"]
[null,null,null,null,"10.33-3-02","Fabricação de sucos de frutas, hortaliças e legumes, exceto concentrados",null,null,null,"10.3","10..3","3-02","-3-02","10..3-3-02","10..3-3-02"]
[null,null,"10.4",null,"","Fabricação de óleos e gorduras vegetais e animais",null,null,null,"",".","","--",".--",""]
[null,null,null,"10.41-4","","Fabricação de óleos vegetais em bruto, exceto óleo de milho",null,null,null,"",".","","--",".--",""]
[null,null,null,null,"10.41-4-00","Fabricação de óleos vegetais em bruto, exceto óleo de milho",null,null,null,"10.4","10..4","4-00","-4-00","10..4-4-00","10..4-4-00"]
[null,null,null,"10.42-2","","Fabricação de óleos vegetais refinados, exceto óleo de milho",null,null,null,"",".","","--",".--",""]
[null,null,null,null,"10.42-2-00","Fabricação de óleos vegetais refinados, exceto óleo de milho",null,null,null,"10.4","10..4","2-00","-2-00","10..4-2-00","10..4-2-00"]
[null,null,null,"10.43-1","","Fabricação de margarina e outras gorduras vegetais e de óleos não comestíveis de animais",null,null,null,"",".","","--",".--",""]
[null,null,null,null,"10.43-1-00","Fabricação de margarina e outras gorduras vegetais e de óleos não comestíveis de animais",null,null,null,"10.4","10..4","1-00","-1-00","10..4-1-00","10..4-1-00"]
[null,null,"10.5",null,"","Laticínios",null,null,null,"",".","","--",".--",""]
[null,null,null,"10.51-1","","Preparação do leite",null,null,null,"",".","","--",".--",""]
[null,null,null,null,"10.51-1-00","Preparação do leite",null,null,null,"10.5","10..5","1-00","-1-00","10..5-1-00","10..5-1-00"]
[null,null,null,"10.52-0","","Fabricação de laticínios",null,null,null,"",".","","--",".--",""]
[null,null,null,null,"10.52-0-00","Fabricação de laticínios",null,null,null,"10.5","10..5","0-00","-0-00","10..5-0-00","10..5-0-00"]
[null,null,null,"10.53-8","","Fabricação de sorvetes e outros gelados comestíveis",null,null,null,"",".","","--",".--",""]
[null,null,null,null,"10.53-8-00","Fabricação de sorvetes e outros gelados comestíveis",null,null,null,"10.5","10..5","8-00","-8-00","10..5-8-00","10..5-8-00"]
[null,null,"10.6",null,"","Moagem, fabricação de produtos amiláceos e de alimentos para animais",null,null,null,"",".","","--",".--",""]
[null,null,null,"10.61-9","","Beneficiamento de arroz e fabricação de produtos do arroz",null,null,null,"",".","","--",".--",""]
[null,null,null,null,"10.61-9-01","Beneficiamento de arroz",null,null,null,"10.6","10..6","9-01","-9-01","10..6-9-01","10..6-9-01"]
[null,null,null,null,"10.61-9-02","Fabricação de produtos do arroz",null,null,null,"10.6","10..6","9-02","-9-02","10..6-9-02","10..6-9-02"]
[null,null,null,"10.62-7","","Moagem de trigo e fabricação de derivados",null,null,null,"",".","","--",".--",""]
[null,null,null,null,"10.62-7-00","Moagem de trigo e fabricação de derivados",null,null,null,"10.6","10..6","7-00","-7-00","10..6-7-00","10..6-7-00"]
[null,null,null,"10.63-5","","Fabricação de farinha de mandioca e derivados",null,null,null,"",".","","--",".--",""]
[null,null,null,null,"10.63-5-00","Fabricação de farinha de mandioca e derivados",null,null,null,"10.6","10..6","5-00","-5-00","10..6-5-00","10..6-5-00"]
[null,null,null,"10.64-3","","Fabricação de farinha de milho e derivados, exceto óleos de milho",null,null,null,"",".","","--",".--",""]
[null,null,null,null,"10.64-3-00","Fabricação de farinha de milho e derivados, exceto óleos de milho",null,null,null,"10.6","10..6","3-00","-3-00","10..6-3-00","10..6-3-00"]
[null,null,null,"10.65-1","","Fabricação de amidos e féculas de vegetais e de óleos de milho",null,null,null,"",".","","--",".--",""]
[null,null,null,null,"10.65-1-01","Fabricação de amidos e féculas de vegetais",null,null,null,"10.6","10..6","1-01","-1-01","10..6-1-01","10..6-1-01"]
[null,null,null,null,"10.65-1-02","Fabricação de óleo de milho em bruto",null,null,null,"10.6","10..6","1-02","-1-02","10..6-1-02","10..6-1-02"]
[null,null,null,null,"10.65-1-03","Fabricação de óleo de milho refinado",null,null,null,"10.6","10..6","1-03","-1-03","10..6-1-03","10..6-1-03"]
[null,null,null,"10.66-0","","Fabricação de alimentos para animais",null,null,null,"",".","","--",".--",""]
[null,null,null,null,"10.66-0-00","Fabricação de alimentos para animais",null,null,null,"10.6","10..6","0-00","-0-00","10..6-0-00","10..6-0-00"]
[null,null,null,"10.69-4","","Moagem e fabricação de produtos de origem vegetal não especificados anteriormente",null,null,null,"",".","","--",".--",""]
[null,null,null,null,"10.69-4-00","Moagem e fabricação de produtos de origem vegetal não especificados anteriormente",null,null,null,"10.6","10..6","4-00","-4-00","10..6-4-00","10..6-4-00"]
[null,null,"10.7",null,"","Fabricação e refino de açúcar",null,null,null,"",".","","--",".--",""]
[null,null,null,"10.71-6","","Fabricação de açúcar em bruto",null,null,null,"",".","","--",".--",""]
[null,null,null,null,"10.71-6-00","Fabricação de açúcar em bruto",null,null,null,"10.7","10..7","6-00","-6-00","10..7-6-00","10..7-6-00"]
[null,null,null,"10.72-4","","Fabricação de açúcar refinado",null,null,null,"",".","","--",".--",""]
[null,null,null,null,"10.72-4-01","Fabricação de açúcar de cana refinado",null,null,null,"10.7","10..7","4-01","-4-01","10..7-4-01","10..7-4-01"]
[null,null,null,null,"10.72-4-02","Fabricação de açúcar de cereais (dextrose) e de beterraba",null,null,null,"10.7","10..7","4-02","-4-02","10..7-4-02","10..7-4-02"]
[null,null,"10.8",null,"","Torrefação e moagem de café",null,null,null,"",".","","--",".--",""]
[null,null,null,"10.81-3","","Torrefação e moagem de café",null,null,null,"",".","","--",".--",""]
[null,null,null,null,"10.81-3-01","Beneficiamento de café",null,null,null,"10.8","10..8","3-01","-3-01","10..8-3-01","10..8-3-01"]
[null,null,null,null,"10.81-3-02","Torrefação e moagem de café",null,null,null,"10.8","10..8","3-02","-3-02","10..8-3-02","10..8-3-02"]
[null,null,null,"10.82-1","","Fabricação de produtos à base de café",null,null,null,"",".","","--",".--",""]
[null,null,null,null,"10.82-1-00","Fabricação de produtos à base de café",null,null,null,"10.8","10..8","1-00","-1-00","10..8-1-00","10..8-1-00"]
[null,null,"10.9",null,"","Fabricação de outros produtos alimentícios",null,null,null,"",".","","--",".--",""]
[null,null,null,"10.91-1","","Fabricação de produtos de panificação",null,null,null,{"$f":"LEFT(E327,4)","v":""},{"$f":"CONCATENATE(LEFT(J327,2),\".\",RIGHT(J327,2))","v":"."},{"$f":"RIGHT(E327,4)","v":""},{"$f":"CONCATENATE(\"-\",LEFT(L327,1),\"-\",RIGHT(L327,2))","v":"--"},{"$f":"CONCATENATE(K327,M327)","v":".--"},""]
[null,null,null,null,"10.91-1-01","Fabricação de produtos de panificação industrial",null,null,null,"10.9","10..9","1-01","-1-01","10..9-1-01","10..9-1-01"]
[null,null,null,null,"10.91-1-02","Fabricação de produtos de padaria e confeitaria com predominância de produção própria",null,null,null,"10.9","10..9","1-02","-1-02","10..9-1-02","10..9-1-02"]
[null,null,null,"10.92-9","","Fabricação de biscoitos e bolachas",null,null,null,"",".","","--",".--",""]
[null,null,null,null,"10.92-9-00","Fabricação de biscoitos e bolachas",null,null,null,"10.9","10..9","9-00","-9-00","10..9-9-00",{"$f":"IF(LEN(N331)=10,N331,\"\")","v":"10..9-9-00"}]
[null,null,null,"10.93-7","","Fabricação de produtos derivados do cacau, de chocolates e confeitos",null,null,null,"",".","","--",".--",""]
[null,null,null,null,"10.93-7-01","Fabricação de produtos derivados do cacau e de chocolates",null,null,null,"10.9","10..9","7-01","-7-01","10..9-7-01","10..9-7-01"]
[null,null,null,null,"10.93-7-02","Fabricação de frutas cristalizadas, balas e semelhantes",null,null,null,"10.9","10..9","7-02","-7-02","10..9-7-02","10..9-7-02"]
[null,null,null,"10.94-5","","Fabricação de massas alimentícias",null,null,null,"",".","","--",".--",""]
[null,null,null,null,"10.94-5-00","Fabricação de massas alimentícias",null,null,null,"10.9","10..9","5-00","-5-00","10..9-5-00","10..9-5-00"]
[null,null,null,"10.95-3","","Fabricação de especiarias, molhos, temperos e condimentos",null,null,null,"",".","","--",".--",""]
[null,null,null,null,"10.95-3-00","Fabricação de especiarias, molhos, temperos e condimentos",null,null,null,"10.9","10..9","3-00","-3-00","10..9-3-00","10..9-3-00"]
[null,null,null,"10.96-1","","Fabricação de alimentos e pratos prontos",null,null,null,"",".","","--",".--",""]
[null,null,null,null,"10.96-1-00","Fabricação de alimentos e pratos prontos",null,null,null,"10.9","10..9","1-00","-1-00","10..9-1-00","10..9-1-00"]
[null,null,null,"10.99-6","","Fabricação de produtos alimentícios não especificados anteriormente",null,null,null,"",".","","--",".--",""]
[null,null,null,null,"10.99-6-01","Fabricação de vinagres",null,null,null,"10.9","10..9","6-01","-6-01","10..9-6-01","10..9-6-01"]
[null,null,null,null,"10.99-6-02","Fabricação de pós-alimentícios",null,null,null,"10.9","10..9","6-02","-6-02","10..9-6-02","10..9-6-02"]
[null,null,null,null,"10.99-6-03","Fabricação de fermentos e leveduras",null,null,null,"10.9","10..9","6-03","-6-03","10..9-6-03","10..9-6-03"]
[null,null,null,null,"10.99-6-04","Fabricação de gelo comum",null,null,null,"10.9","10..9","6-04","-6-04","10..9-6-04","10..9-6-04"]
[null,null,null,null,"10.99-6-05","Fabricação de produtos para infusão (chá, mate, etc.)",null,null,null,"10.9","10..9","6-05","-6-05","10..9-6-05","10..9-6-05"]
[null,null,null,null,"10.99-6-06","Fabricação de adoçantes naturais e artificiais",null,null,null,"10.9","10..9","6-06","-6-06","10..9-6-06","10..9-6-06"]
[null,null,null,null,"10.99-6-07","Fabricação de alimentos dietéticos e complementos alimentares",null,null,null,"10.9","10..9","6-07","-6-07","10..9-6-07","10..9-6-07"]
[null,null,null,null,"10.99-6-99","Fabricação de outros produtos alimentícios não especificados anteriormente",null,null,null,"10.9","10..9","6-99","-6-99","10..9-6-99","10..9-6-99"]
[null,"11",null,null,"","FABRICAÇÃO DE BEBIDAS",null,null,null,"",".","","--",".--",""]
[null,null,"11.1",null,"","Fabricação de bebidas alcoólicas",null,null,null,"",".","","--",".--",""]
[null,null,null,"11.11-9","","Fabricação de aguardentes e outras bebidas destiladas",null,null,null,"",".","","--",".--",""]
[null,null,null,null,"11.11-9-01","Fabricação de aguardente de cana-de-açúcar",null,null,null,"11.1","11..1","9-01","-9-01","11..1-9-01","11..1-9-01"]
[null,null,null,null,"11.11-9-02","Fabricação de outras aguardentes e bebidas destiladas",null,null,null,"11.1","11..1","9-02","-9-02","11..1-9-02","11..1-9-02"]
[null,null,null,"11.12-7","","Fabricação de vinho",null,null,null,"",".","","--",".--",""]
[null,null,null,null,"11.12-7-00","Fabricação de vinho",null,null,null,"11.1","11..1","7-00","-7-00","11..1-7-00","11..1-7-00"]
[null,null,null,"11.13-5","","Fabricação de malte, cervejas e chopes",null,null,null,"",".","","--",".--",""]
[null,null,null,null,"11.13-5-01","Fabricação de malte, inclusive malte uísque",null,null,null,"11.1","11..1","5-01","-5-01","11..1-5-01","11..1-5-01"]
[null,null,null,null,"11.13-5-02","Fabricação de cervejas e chopes",null,null,null,"11.1","11..1","5-02","-5-02","11..1-5-02","11..1-5-02"]
[null,null,"11.2",null,"","Fabricação de bebidas não alcoólicas",null,null,null,"",".","","--",".--",""]
[null,null,null,"11.21-6","","Fabricação de águas envasadas",null,null,null,"",".","","--",".--",""]
[null,null,null,null,"11.21-6-00","Fabricação de águas envasadas",null,null,null,"11.2","11..2","6-00","-6-00","11..2-6-00","11..2-6-00"]
[null,null,null,"11.22-4","","Fabricação de refrigerantes e de outras bebidas não alcoólicas",null,null,null,"",".","","--",".--",""]
[null,null,null,null,"11.22-4-01","Fabricação de refrigerantes",null,null,null,"11.2","11..2","4-01","-4-01","11..2-4-01","11..2-4-01"]
[null,null,null,null,"11.22-4-02","Fabricação de chá mate e outros chás prontos para consumo",null,null,null,"11.2","11..2","4-02","-4-02","11..2-4-02","11..2-4-02"]
[null,null,null,null,"11.22-4-03","Fabricação de refrescos, xaropes e pós para refrescos, exceto refrescos de frutas",null,null,null,"11.2","11..2","4-03","-4-03","11..2-4-03","11..2-4-03"]
[null,null,null,null,"11.22-4-04","Fabricação de bebidas isotônicas",null,null,null,"11.2","11..2","4-04","-4-04","11..2-4-04","11..2-4-04"]
[null,null,null,null,"11.22-4-99","Fabricação de outras bebidas não alcoólicas não especificadas anteriormente",null,null,null,"11.2","11..2","4-99","-4-99","11..2-4-99","11..2-4-99"]
[null,"12",null,null,"","FABRICAÇÃO DE PRODUTOS DO FUMO",null,null,null,"",".","","--",".--",""]
[null,null,"12.1",null,"","Processamento industrial do fumo",null,null,null,"",".","","--",".--",""]
[null,null,null,"12.10-7","","Processamento industrial do fumo",null,null,null,"",".","","--",".--",""]
[null,null,null,null,"12.10-7-00","Processamento industrial do fumo",null,null,null,"12.1","12..1","7-00","-7-00","12..1-7-00","12..1-7-00"]
[null,null,"12.2",null,"","Fabricação de produtos do fumo",null,null,null,"",".","","--",".--",""]
[null,null,null,"12.20-4","","Fabricação de produtos do fumo",null,null,null,"",".","","--",".--",""]
[null,null,null,null,"12.20-4-01","Fabricação de cigarros",null,null,null,"12.2","12..2","4-01","-4-01","12..2-4-01","12..2-4-01"]
[null,null,null,null,"12.20-4-02","Fabricação de cigarrilhas e charutos",null,null,null,"12.2","12..2","4-02","-4-02","12..2-4-02","12..2-4-02"]
[null,null,null,null,"12.20-4-03","Fabricação de filtros para cigarros",null,null,null,"12.2","12..2","4-03","-4-03","12..2-4-03","12..2-4-03"]
[null,null,null,null,"12.20-4-99","Fabricação de outros produtos do fumo, exceto cigarros, cigarrilhas e charutos",null,null,null,"12.2","12..2","4-99","-4-99","12..2-4-99","12..2-4-99"]
[null,"13",null,null,"","FABRICAÇÃO DE PRODUTOS TÊXTEIS",null,null,null,"",".","","--",".--",""]
[null,null,"13.1",null,"","Preparação e fiação de fibras têxteis",null,null,null,"",".","","--",".--",""]
[null,null,null,"13.11-1","","Preparação e fiação de fibras de algodão",null,null,null,"",".","","--",".--",""]
[null,null,null,null,"13.11-1-00","Preparação e fiação de fibras de algodão",null,null,null,"13.1","13..1","1-00","-1-00","13..1-1-00","13..1-1-00"]
[null,null,null,"13.12-0","","Preparação e fiação de fibras têxteis naturais, exceto algodão",null,null,null,"",".","","--",".--",""]
[null,null,null,null,"13.12-0-00","Preparação e fiação de fibras têxteis naturais, exceto algodão",null,null,null,"13.1","13..1","0-00","-0-00","13..1-0-00","13..1-0-00"]
[null,null,null,"13.13-8","","Fiação de fibras artificiais e sintéticas",null,null,null,"",".","","--",".--",""]
[null,null,null,null,"13.13-8-00","Fiação de fibras artificiais e sintéticas",null,null,null,"13.1","13..1","8-00","-8-00","13..1-8-00","13..1-8-00"]
[null,null,null,"13.14-6","","Fabricação de linhas para costurar e bordar",null,null,null,"",".","","--",".--",""]
[null,null,null,null,"13.14-6-00","Fabricação de linhas para costurar e bordar",null,null,null,"13.1","13..1","6-00","-6-00","13..1-6-00","13..1-6-00"]
[null,null,"13.2",null,"","Tecelagem, exceto malha",null,null,null,"",".","","--",".--",""]
[null,null,null,"13.21-9","","Tecelagem de fios de algodão",null,null,null,"",".","","--",".--",""]
[null,null,null,null,"13.21-9-00","Tecelagem de fios de algodão",null,null,null,{"$f":"LEFT(E391,4)","v":"13.2"},{"$f":"CONCATENATE(LEFT(J391,2),\".\",RIGHT(J391,2))","v":"13..2"},{"$f":"RIGHT(E391,4)","v":"9-00"},{"$f":"CONCATENATE(\"-\",LEFT(L391,1),\"-\",RIGHT(L391,2))","v":"-9-00"},{"$f":"CONCATENATE(K391,M391)","v":"13..2-9-00"},"13..2-9-00"]
[null,null,null,"13.22-7","","Tecelagem de fios de fibras têxteis naturais, exceto algodão",null,null,null,"",".","","--",".--",""]
[null,null,null,null,"13.22-7-00","Tecelagem de fios de fibras têxteis naturais, exceto algodão",null,null,null,"13.2","13..2","7-00","-7-00","13..2-7-00","13..2-7-00"]
[null,null,null,"13.23-5","","Tecelagem de fios de fibras artificiais e sintéticas",null,null,null,"",".","","--",".--",""]
[null,null,null,null,"13.23-5-00","Tecelagem de fios de fibras artificiais e sintéticas",null,null,null,"13.2","13..2","5-00","-5-00","13..2-5-00",{"$f":"IF(LEN(N395)=10,N395,\"\")","v":"13..2-5-00"}]
[null,null,"13.3",null,"","Fabricação de tecidos de malha",null,null,null,"",".","","--",".--",""]
[null,null,null,"13.30-8","","Fabricação de tecidos de malha",null,null,null,"",".","","--",".--",""]
[null,null,null,null,"13.30-8-00","Fabricação de tecidos de malha",null,null,null,"13.3","13..3","8-00","-8-00","13..3-8-00","13..3-8-00"]
[null,null,"13.4",null,"","Acabamentos em fios, tecidos e artefatos têxteis",null,null,null,"",".","","--",".--",""]
[null,null,null,"13.40-5","","Acabamentos em fios, tecidos e artefatos têxteis",null,null,null,"",".","","--",".--",""]
[null,null,null,null,"13.40-5-01","Estamparia e texturização em fios, tecidos, artefatos têxteis e peças do vestuário",null,null,null,"13.4","13..4","5-01","-5-01","13..4-5-01","13..4-5-01"]
[null,null,null,null,"13.40-5-02","Alvejamento, tingimento e torção em fios, tecidos, artefatos têxteis e peças do vestuário",null,null,null,"13.4","13..4","5-02","-5-02","13..4-5-02","13..4-5-02"]
[null,null,null,null,"13.40-5-99","Outros serviços de acabamento em fios, tecidos, artefatos têxteis e peças do vestuário",null,null,null,"13.4","13..4","5-99","-5-99","13..4-5-99","13..4-5-99"]
[null,null,"13.5",null,"","Fabricação de artefatos têxteis, exceto vestuário",null,null,null,"",".","","--",".--",""]
[null,null,null,"13.51-1","","Fabricação de artefatos têxteis para uso doméstico",null,null,null,"",".","","--",".--",""]
[null,null,null,null,"13.51-1-00","Fabricação de artefatos têxteis para uso doméstico",null,null,null,"13.5","13..5","1-00","-1-00","13..5-1-00","13..5-1-00"]
[null,null,null,"13.52-9","","Fabricação de artefatos de tapeçaria",null,null,null,"",".","","--",".--",""]
[null,null,null,null,"13.52-9-00","Fabricação de artefatos de tapeçaria",null,null,null,"13.5","13..5","9-00","-9-00","13..5-9-00","13..5-9-00"]
[null,null,null,"13.53-7","","Fabricação de artefatos de cordoaria",null,null,null,"",".","","--",".--",""]
[null,null,null,null,"13.53-7-00","Fabricação de artefatos de cordoaria",null,null,null,"13.5","13..5","7-00","-7-00","13..5-7-00","13..5-7-00"]
[null,null,null,"13.54-5","","Fabricação de tecidos especiais, inclusive artefatos",null,null,null,"",".","","--",".--",""]
[null,null,null,null,"13.54-5-00","Fabricação de tecidos especiais, inclusive artefatos",null,null,null,"13.5","13..5","5-00","-5-00","13..5-5-00","13..5-5-00"]
[null,null,null,"13.59-6","","Fabricação de outros produtos têxteis não especificados anteriormente",null,null,null,"",".","","--",".--",""]
[null,null,null,null,"13.59-6-00","Fabricação de outros produtos têxteis não especificados anteriormente",null,null,null,"13.5","13..5","6-00","-6-00","13..5-6-00","13..5-6-00"]
[null,"14",null,null,"","CONFECÇÃO DE ARTIGOS DO VESTUÁRIO E ACESSÓRIOS",null,null,null,"",".","","--",".--",""]
[null,null,"14.1",null,"","Confecção de artigos do vestuário e acessórios",null,null,null,"",".","","--",".--",""]
[null,null,null,"14.11-8","","Confecção de roupas íntimas",null,null,null,"",".","","--",".--",""]
[null,null,null,null,"14.11-8-01","Confecção de roupas íntimas",null,null,null,"14.1","14..1","8-01","-8-01","14..1-8-01","14..1-8-01"]
[null,null,null,null,"14.11-8-02","Facção de roupas íntimas",null,null,null,"14.1","14..1","8-02","-8-02","14..1-8-02","14..1-8-02"]
[null,null,null,"14.12-6","","Confecção de peças do vestuário, exceto roupas íntimas",null,null,null,"",".","","--",".--",""]
[null,null,null,null,"14.12-6-01","Confecção de peças do vestuário, exceto roupas íntimas e as confeccionadas sob medida",null,null,null,"14.1","14..1","6-01","-6-01","14..1-6-01","14..1-6-01"]
[null,null,null,null,"14.12-6-02","Confecção, sob medida, de peças do vestuário, exceto roupas íntimas",null,null,null,"14.1","14..1","6-02","-6-02","14..1-6-02","14..1-6-02"]
[null,null,null,null,"14.12-6-03","Facção de peças do vestuário, exceto roupas íntimas",null,null,null,"14.1","14..1","6-03","-6-03","14..1-6-03","14..1-6-03"]
[null,null,null,"14.13-4","","Confecção de roupas profissionais",null,null,null,"",".","","--",".--",""]
[null,null,null,null,"14.13-4-01","Confecção de roupas profissionais, exceto sob medida",null,null,null,"14.1","14..1","4-01","-4-01","14..1-4-01","14..1-4-01"]
[null,null,null,null,"14.13-4-02","Confecção, sob medida, de roupas profissionais",null,null,null,"14.1","14..1","4-02","-4-02","14..1-4-02","14..1-4-02"]
[null,null,null,null,"14.13-4-03","Facção de roupas profissionais",null,null,null,"14.1","14..1","4-03","-4-03","14..1-4-03","14..1-4-03"]
[null,null,null,"14.14-2","","Fabricação de acessórios do vestuário, exceto para segurança e proteção",null,null,null,"",".","","--",".--",""]
[null,null,null,null,"14.14-2-00","Fabricação de acessórios do vestuário, exceto para segurança e proteção",null,null,null,"14.1","14..1","2-00","-2-00","14..1-2-00","14..1-2-00"]
[null,null,"14.2",null,"","Fabricação de artigos de malharia e tricotagem",null,null,null,"",".","","--",".--",""]
[null,null,null,"14.21-5","","Fabricação de meias",null,null,null,"",".","","--",".--",""]
[null,null,null,null,"14.21-5-00","Fabricação de meias",null,null,null,"14.2","14..2","5-00","-5-00","14..2-5-00","14..2-5-00"]
[null,null,null,"14.22-3","","Fabricação de artigos do vestuário, produzidos em malharias e tricotagens, exceto meias",null,null,null,"",".","","--",".--",""]
[null,null,null,null,"14.22-3-00","Fabricação de artigos do vestuário, produzidos em malharias e tricotagens, exceto meias",null,null,null,"14.2","14..2","3-00","-3-00","14..2-3-00","14..2-3-00"]
[null,"15",null,null,"","PREPARAÇÃO DE COUROS E FABRICAÇÃO DE ARTEFATOS DE COURO, ARTIGOS PARA VIAGEM E CALÇADOS",null,null,null,"",".","","--",".--",""]
[null,null,"15.1",null,"","Curtimento e outras preparações de couro",null,null,null,"",".","","--",".--",""]
[null,null,null,"15.10-6","","Curtimento e outras preparações de couro",null,null,null,"",".","","--",".--",""]
[null,null,null,null,"15.10-6-00","Curtimento e outras preparações de couro",null,null,null,"15.1","15..1","6-00","-6-00","15..1-6-00","15..1-6-00"]
[null,null,"15.2",null,"","Fabricação de artigos para viagem e de artefatos diversos de couro",null,null,null,"",".","","--",".--",""]
[null,null,null,"15.21-1","","Fabricação de artigos para viagem, bolsas e semelhantes de qualquer material",null,null,null,"",".","","--",".--",""]
[null,null,null,null,"15.21-1-00","Fabricação de artigos para viagem, bolsas e semelhantes de qualquer material",null,null,null,"15.2","15..2","1-00","-1-00","15..2-1-00","15..2-1-00"]
[null,null,null,"15.29-7","","Fabricação de artefatos de couro não especificados anteriormente",null,null,null,"",".","","--",".--",""]
[null,null,null,null,"15.29-7-00","Fabricação de artefatos de couro não especificados anteriormente",null,null,null,"15.2","15..2","7-00","-7-00","15..2-7-00","15..2-7-00"]
[null,null,"15.3",null,"","Fabricação de calçados",null,null,null,"",".","","--",".--",""]
[null,null,null,"15.31-9","","Fabricação de calçados de couro",null,null,null,"",".","","--",".--",""]
[null,null,null,null,"15.31-9-01","Fabricação de calçados de couro",null,null,null,"15.3","15..3","9-01","-9-01","15..3-9-01","15..3-9-01"]
[null,null,null,null,"15.31-9-02","Acabamento de calçados de couro sob contrato",null,null,null,"15.3","15..3","9-02","-9-02","15..3-9-02","15..3-9-02"]
[null,null,null,"15.32-7","","Fabricação de tênis de qualquer material",null,null,null,"",".","","--",".--",""]
[null,null,null,null,"15.32-7-00","Fabricação de tênis de qualquer material",null,null,null,"15.3","15..3","7-00","-7-00","15..3-7-00","15..3-7-00"]
[null,null,null,"15.33-5","","Fabricação de calçados de material sintético",null,null,null,"",".","","--",".--",""]
[null,null,null,null,"15.33-5-00","Fabricação de calçados de material sintético",null,null,null,"15.3","15..3","5-00","-5-00","15..3-5-00","15..3-5-00"]
[null,null,null,"15.39-4","","Fabricação de calçados de materiais não especificados anteriormente",null,null,null,"",".","","--",".--",""]
[null,null,null,null,"15.39-4-00","Fabricação de calçados de materiais não especificados\nanteriormente",null,null,null,"15.3","15..3","4-00","-4-00","15..3-4-00","15..3-4-00"]
[null,null,"15.4",null,"","Fabricação de partes para calçados, de qualquer material",null,null,null,"",".","","--",".--",""]
[null,null,null,"15.40-8","","Fabricação de partes para calçados, de qualquer material",null,null,null,{"$f":"LEFT(E455,4)","v":""},{"$f":"CONCATENATE(LEFT(J455,2),\".\",RIGHT(J455,2))","v":"."},{"$f":"RIGHT(E455,4)","v":""},{"$f":"CONCATENATE(\"-\",LEFT(L455,1),\"-\",RIGHT(L455,2))","v":"--"},{"$f":"CONCATENATE(K455,M455)","v":".--"},""]
[null,null,null,null,"15.40-8-00","Fabricação de partes para calçados, de qualquer material",null,null,null,"15.4","15..4","8-00","-8-00","15..4-8-00","15..4-8-00"]
[null,"16",null,null,"","FABRICAÇÃO DE PRODUTOS DE MADEIRA",null,null,null,"",".","","--",".--",""]
[null,null,"16.1",null,"","Desdobramento de madeira",null,null,null,"",".","","--",".--",""]
[null,null,null,"16.10-2","","Desdobramento de madeira",null,null,null,"",".","","--",".--",{"$f":"IF(LEN(N459)=10,N459,\"\")","v":""}]
[null,null,null,null,"16.10-2-03","Serrarias com desdobramento de madeira em bruto",null,null,null,"16.1","16..1","2-03","-2-03","16..1-2-03","16..1-2-03"]
[null,null,null,null,"16.10-2-04","Serrarias sem desdobramento de madeira em bruto - Resseragem",null,null,null,"16.1","16..1","2-04","-2-04","16..1-2-04","16..1-2-04"]
[null,null,null,null,"16.10-2-05","Serviço de tratamento de madeira realizado sob contrato",null,null,null,"16.1","16..1","2-05","-2-05","16..1-2-05","16..1-2-05"]
[null,null,"16.2",null,"","Fabricação de produtos de madeira, cortiça e material trançado, exceto móveis",null,null,null,"",".","","--",".--",""]
[null,null,null,"16.21-8","","Fabricação de madeira laminada e de chapas de madeira compensada, prensada e aglomerada",null,null,null,"",".","","--",".--",""]
[null,null,null,null,"16.21-8-00","Fabricação de madeira laminada e de chapas de madeira compensada, prensada e aglomerada",null,null,null,"16.2","16..2","8-00","-8-00","16..2-8-00","16..2-8-00"]
[null,null,null,"16.22-6","","Fabricação de estruturas de madeira e de artigos de carpintaria para construção",null,null,null,"",".","","--",".--",""]
[null,null,null,null,"16.22-6-01","Fabricação de casas de madeira pré-fabricadas","SIM",null,null,"16.2","16..2","6-01","-6-01","16..2-6-01","16..2-6-01"]
[null,null,null,null,"16.22-6-02","Fabricação de esquadrias de madeira e de peças de madeira para instalações industriais e comerciais","SIM",null,null,"16.2","16..2","6-02","-6-02","16..2-6-02","16..2-6-02"]
[null,null,null,null,"16.22-6-99","Fabricação de outros artigos de carpintaria para construção","SIM",null,null,"16.2","16..2","6-99","-6-99","16..2-6-99","16..2-6-99"]
[null,null,null,"16.23-4","","Fabricação de artefatos de tanoaria e de embalagens de madeira",null,null,null,"",".","","--",".--",""]
[null,null,null,null,"16.23-4-00","Fabricação de artefatos de tanoaria e de embalagens de madeira",null,null,null,"16.2","16..2","4-00","-4-00","16..2-4-00","16..2-4-00"]
[null,null,null,"16.29-3","","Fabricação de artefatos de madeira, palha, cortiça, vime e material trançado não especificados anteriormente, exceto\nmóveis",null,null,null,"",".","","--",".--",""]
[null,null,null,null,"16.29-3-01","Fabricação de artefatos diversos de madeira, exceto móveis",null,null,null,"16.2","16..2","3-01","-3-01","16..2-3-01","16..2-3-01"]
[null,null,null,null,"16.29-3-02","Fabricação de artefatos diversos de cortiça, bambu, palha, vime e outros materiais trançados, exceto móveis",null,null,null,"16.2","16..2","3-02","-3-02","16..2-3-02","16..2-3-02"]
[null,"17",null,null,"","FABRICAÇÃO DE CELULOSE, PAPEL E PRODUTOS DE PAPEL",null,null,null,"",".","","--",".--",""]
[null,null,"17.1",null,"","Fabricação de celulose e outras pastas para a fabricação de papel",null,null,null,"",".","","--",".--",""]
[null,null,null,"17.10-9","","Fabricação de celulose e outras pastas para a fabricação de papel",null,null,null,"",".","","--",".--",""]
[null,null,null,null,"17.10-9-00","Fabricação de celulose e outras pastas para a fabricação de papel",null,null,null,"17.1","17..1","9-00","-9-00","17..1-9-00","17..1-9-00"]
[null,null,"17.2",null,"","Fabricação de papel, cartolina e papel-cartão",null,null,null,"",".","","--",".--",""]
[null,null,null,"17.21-4","","Fabricação de papel",null,null,null,"",".","","--",".--",""]
[null,null,null,null,"17.21-4-00","Fabricação de papel",null,null,null,"17.2","17..2","4-00","-4-00","17..2-4-00","17..2-4-00"]
[null,null,null,"17.22-2","","Fabricação de cartolina e papel-cartão",null,null,null,"",".","","--",".--",""]
[null,null,null,null,"17.22-2-00","Fabricação de cartolina e papel-cartão",null,null,null,"17.2","17..2","2-00","-2-00","17..2-2-00","17..2-2-00"]
[null,null,"17.3",null,"","Fabricação de embalagens de papel, cartolina, papel-cartão e papelão ondulado",null,null,null,"",".","","--",".--",""]
[null,null,null,"17.31-1","","Fabricação de embalagens de papel",null,null,null,"",".","","--",".--",""]
[null,null,null,null,"17.31-1-00","Fabricação de embalagens de papel",null,null,null,"17.3","17..3","1-00","-1-00","17..3-1-00","17..3-1-00"]
[null,null,null,"17.32-0","","Fabricação de embalagens de cartolina e papel-cartão",null,null,null,"",".","","--",".--",""]
[null,null,null,null,"17.32-0-00","Fabricação de embalagens de cartolina e papel-cartão",null,null,null,"17.3","17..3","0-00","-0-00","17..3-0-00","17..3-0-00"]
[null,null,null,"17.33-8","","Fabricação de chapas e de embalagens de papelão ondulado",null,null,null,"",".","","--",".--",""]
[null,null,null,null,"17.33-8-00","Fabricação de chapas e de embalagens de papelão ondulado",null,null,null,"17.3","17..3","8-00","-8-00","17..3-8-00","17..3-8-00"]
[null,null,"17.4",null,"","Fabricação de produtos diversos de papel, cartolina, papel-cartão e papelão ondulado",null,null,null,"",".","","--",".--",""]
[null,null,null,"17.41-9","","Fabricação de produtos de papel, cartolina, papel-cartão e papelão ondulado para uso comercial e de escritório",null,null,null,"",".","","--",".--",""]
[null,null,null,null,"17.41-9-01","Fabricação de formulários contínuos",null,null,null,"17.4","17..4","9-01","-9-01","17..4-9-01","17..4-9-01"]
[null,null,null,null,"17.41-9-02","Fabricação de produtos de papel, cartolina, papel-cartão e papelão ondulado para uso comercial e de escritório",null,null,null,"17.4","17..4","9-02","-9-02","17..4-9-02","17..4-9-02"]
[null,null,null,"17.42-7","","Fabricação de produtos de papel para usos doméstico e higiênico-sanitário",null,null,null,"",".","","--",".--",""]
[null,null,null,null,"17.42-7-01","Fabricação de fraldas descartáveis",null,null,null,"17.4","17..4","7-01","-7-01","17..4-7-01","17..4-7-01"]
[null,null,null,null,"17.42-7-02","Fabricação de absorventes higiênicos",null,null,null,"17.4","17..4","7-02","-7-02","17..4-7-02","17..4-7-02"]
[null,null,null,null,"17.42-7-99","Fabricação de produtos de papel para uso doméstico e higiênico-sanitário não especificados anteriormente",null,null,null,"17.4","17..4","7-99","-7-99","17..4-7-99","17..4-7-99"]
[null,null,null,"17.49-4","","Fabricação de produtos de pastas celulósicas, papel, cartolina, papel-cartão e papelão ondulado não especificados anteriormente",null,null,null,"",".","","--",".--",""]
[null,null,null,null,"17.49-4-00","Fabricação de produtos de pastas celulósicas, papel, cartolina, papel-cartão e papelão ondulado não especificados anteriormente",null,null,null,"17.4","17..4","4-00","-4-00","17..4-4-00","17..4-4-00"]
[null,"18",null,null,"","IMPRESSÃO E REPRODUÇÃO DE GRAVAÇÕES",null,null,null,"",".","","--",".--",""]
[null,null,"18.1",null,"","Atividade de impressão",null,null,null,"",".","","--",".--",""]
[null,null,null,"18.11-3","","Impressão de jornais, livros, revistas e outras publicações periódicas",null,null,null,"",".","","--",".--",""]
[null,null,null,null,"18.11-3-01","Impressão de jornais",null,null,null,"18.1","18..1","3-01","-3-01","18..1-3-01","18..1-3-01"]
[null,null,null,null,"18.11-3-02","Impressão de livros, revistas e outras publicações periódicas",null,null,null,"18.1","18..1","3-02","-3-02","18..1-3-02","18..1-3-02"]
[null,null,null,"18.12-1","","Impressão de material de segurança",null,null,null,"",".","","--",".--",""]
[null,null,null,null,"18.12-1-00","Impressão de material de segurança",null,null,null,"18.1","18..1","1-00","-1-00","18..1-1-00","18..1-1-00"]
[null,null,null,"18.13-0","","Impressão de materiais para outros usos",null,null,null,"",".","","--",".--",""]
[null,null,null,null,"18.13-0-01","Impressão de material para uso publicitário",null,null,null,"18.1","18..1","0-01","-0-01","18..1-0-01","18..1-0-01"]
[null,null,null,null,"18.13-0-99","Impressão de material para outros usos",null,null,null,"18.1","18..1","0-99","-0-99","18..1-0-99","18..1-0-99"]
[null,null,"18.2",null,"","Serviços de pré-impressão e acabamentos gráficos",null,null,null,"",".","","--",".--",""]
[null,null,null,"18.21-1","","Serviços de pré-impressão",null,null,null,"",".","","--",".--",""]
[null,null,null,null,"18.21-1-00","Serviços de pré-impressão",null,null,null,"18.2","18..2","1-00","-1-00","18..2-1-00","18..2-1-00"]
[null,null,null,"18.22-9","","Serviços de acabamentos gráficos",null,null,null,"",".","","--",".--",""]
[null,null,null,null,"18.22-9-01","Serviços de encadernação e plastificação",null,null,null,"18.2","18..2","9-01","-9-01","18..2-9-01","18..2-9-01"]
[null,null,null,null,"18.22-9-99","Serviços de acabamentos gráficos, exceto encadernação e plastificação",null,null,null,"18.2","18..2","9-99","-9-99","18..2-9-99","18..2-9-99"]
[null,null,"18.3",null,"","Reprodução de materiais gravados em qualquer suporte",null,null,null,"",".","","--",".--",""]
[null,null,null,"18.30-0","","Reprodução de materiais gravados em qualquer suporte",null,null,null,"",".","","--",".--",""]
[null,null,null,null,"18.30-0-01","Reprodução de som em qualquer suporte",null,null,null,{"$f":"LEFT(E519,4)","v":"18.3"},{"$f":"CONCATENATE(LEFT(J519,2),\".\",RIGHT(J519,2))","v":"18..3"},{"$f":"RIGHT(E519,4)","v":"0-01"},{"$f":"CONCATENATE(\"-\",LEFT(L519,1),\"-\",RIGHT(L519,2))","v":"-0-01"},{"$f":"CONCATENATE(K519,M519)","v":"18..3-0-01"},"18..3-0-01"]
[null,null,null,null,"18.30-0-02","Reprodução de vídeo em qualquer suporte",null,null,null,"18.3","18..3","0-02","-0-02","18..3-0-02","18..3-0-02"]
[null,null,null,null,"18.30-0-03","Reprodução de software em qualquer suporte",null,null,null,"18.3","18..3","0-03","-0-03","18..3-0-03","18..3-0-03"]
[null,"19",null,null,"","FABRICAÇÃO DE COQUE, DE PRODUTOS DERIVADOS DO PETRÓLEO E DE BIOCOMBUSTÍVEIS",null,null,null,"",".","","--",".--",""]
[null,null,"19.1",null,"","Coquerias",null,null,null,"",".","","--",".--",{"$f":"IF(LEN(N523)=10,N523,\"\")","v":""}]
[null,null,null,"19.10-1","","Coquerias",null,null,null,"",".","","--",".--",""]
[null,null,null,null,"19.10-1-00","Coquerias",null,null,null,"19.1","19..1","1-00","-1-00","19..1-1-00","19..1-1-00"]
[null,null,"19.2",null,"","Fabricação de produtos derivados do petróleo",null,null,null,"",".","","--",".--",""]
[null,null,null,"19.21-7","","Fabricação de produtos do refino de petróleo",null,null,null,"",".","","--",".--",""]
[null,null,null,null,"19.21-7-00","Fabricação de produtos do refino de petróleo",null,null,null,"19.2","19..2","7-00","-7-00","19..2-7-00","19..2-7-00"]
[null,null,null,"19.22-5","","Fabricação de produtos derivados do petróleo, exceto produtos do refino",null,null,null,"",".","","--",".--",""]
[null,null,null,null,"19.22-5-01","Formulação de combustíveis",null,null,null,"19.2","19..2","5-01","-5-01","19..2-5-01","19..2-5-01"]
[null,null,null,null,"19.22-5-02","Rerrefino de óleos lubrificantes",null,null,null,"19.2","19..2","5-02","-5-02","19..2-5-02","19..2-5-02"]
[null,null,null,null,"19.22-5-99","Fabricação de outros produtos derivados do petróleo, exceto produtos do refino",null,null,null,"19.2","19..2","5-99","-5-99","19..2-5-99","19..2-5-99"]
[null,null,"19.3",null,"","Fabricação de biocombustíveis",null,null,null,"",".","","--",".--",""]
[null,null,null,"19.31-4","","Fabricação de álcool",null,null,null,"",".","","--",".--",""]
[null,null,null,null,"19.31-4-00","Fabricação de álcool",null,null,null,"19.3","19..3","4-00","-4-00","19..3-4-00","19..3-4-00"]
[null,null,null,"19.32-2","","Fabricação de biocombustíveis, exceto álcool",null,null,null,"",".","","--",".--",""]
[null,null,null,null,"19.32-2-00","Fabricação de biocombustíveis, exceto álcool",null,null,null,"19.3","19..3","2-00","-2-00","19..3-2-00","19..3-2-00"]
[null,"20",null,null,"","FABRICAÇÃO DE PRODUTOS QUÍMICOS",null,null,null,"",".","","--",".--",""]
[null,null,"20.1",null,"","Fabricação de produtos químicos inorgânicos",null,null,null,"",".","","--",".--",""]
[null,null,null,"20.11-8","","Fabricação de cloro e álcalis",null,null,null,"",".","","--",".--",""]
[null,null,null,null,"20.11-8-00","Fabricação de cloro e álcalis",null,null,null,"20.1","20..1","8-00","-8-00","20..1-8-00","20..1-8-00"]
[null,null,null,"20.12-6","","Fabricação de intermediários para fertilizantes",null,null,null,"",".","","--",".--",""]
[null,null,null,null,"20.12-6-00","Fabricação de intermediários para fertilizantes",null,null,null,"20.1","20..1","6-00","-6-00","20..1-6-00","20..1-6-00"]
[null,null,null,"20.13-4","","Fabricação de adubos e fertilizantes",null,null,null,"",".","","--",".--",""]
[null,null,null,null,"20.13-4-01","Fabricação de adubos e fertilizantes organo-minerais",null,null,null,"20.1","20..1","4-01","-4-01","20..1-4-01","20..1-4-01"]
[null,null,null,null,"20.13-4-02","Fabricação de adubos e fertilizantes, exceto organo-minerais",null,null,null,"20.1","20..1","4-02","-4-02","20..1-4-02","20..1-4-02"]
[null,null,null,"20.14-2","","Fabricação de gases industriais",null,null,null,"",".","","--",".--",""]
[null,null,null,null,"20.14-2-00","Fabricação de gases industriais",null,null,null,"20.1","20..1","2-00","-2-00","20..1-2-00","20..1-2-00"]
[null,null,null,"20.19-3","","Fabricação de produtos químicos inorgânicos não especificados anteriormente",null,null,null,"",".","","--",".--",""]
[null,null,null,null,"20.19-3-01","Elaboração de combustíveis nucleares",null,null,null,"20.1","20..1","3-01","-3-01","20..1-3-01","20..1-3-01"]
[null,null,null,null,"20.19-3-99","Fabricação de outros produtos químicos inorgânicos não especificados anteriormente",null,null,null,"20.1","20..1","3-99","-3-99","20..1-3-99","20..1-3-99"]
[null,null,"20.2",null,"","Fabricação de produtos químicos orgânicos",null,null,null,"",".","","--",".--",""]
[null,null,null,"20.21-5","","Fabricação de produtos petroquímicos básicos",null,null,null,"",".","","--",".--",""]
[null,null,null,null,"20.21-5-00","Fabricação de produtos petroquímicos básicos",null,null,null,"20.2","20..2","5-00","-5-00","20..2-5-00","20..2-5-00"]
[null,null,null,"20.22-3","","Fabricação de intermediários para plastificantes, resinas e fibras",null,null,null,"",".","","--",".--",""]
[null,null,null,null,"20.22-3-00","Fabricação de intermediários para plastificantes, resinas e fibras",null,null,null,"20.2","20..2","3-00","-3-00","20..2-3-00","20..2-3-00"]
[null,null,null,"20.29-1","","Fabricação de produtos químicos orgânicos não especificados anteriormente",null,null,null,"",".","","--",".--",""]
[null,null,null,null,"20.29-1-00","Fabricação de produtos químicos orgânicos não especificados anteriormente",null,null,null,"20.2","20..2","1-00","-1-00","20..2-1-00","20..2-1-00"]
[null,null,"20.3",null,"","Fabricação de resinas e elastômeros",null,null,null,"",".","","--",".--",""]
[null,null,null,"20.31-2","","Fabricação de resinas termoplásticas",null,null,null,"",".","","--",".--",""]
[null,null,null,null,"20.31-2-00","Fabricação de resinas termoplásticas",null,null,null,"20.3","20..3","2-00","-2-00","20..3-2-00","20..3-2-00"]
[null,null,null,"20.32-1","","Fabricação de resinas termofixas",null,null,null,"",".","","--",".--",""]
[null,null,null,null,"20.32-1-00","Fabricação de resinas termofixas",null,null,null,"20.3","20..3","1-00","-1-00","20..3-1-00","20..3-1-00"]
[null,null,null,"20.33-9","","Fabricação de elastômeros",null,null,null,"",".","","--",".--",""]
[null,null,null,null,"20.33-9-00","Fabricação de elastômeros",null,null,null,"20.3","20..3","9-00","-9-00","20..3-9-00","20..3-9-00"]
[null,null,"20.4",null,"","Fabricação de fibras artificiais e sintéticas",null,null,null,"",".","","--",".--",""]
[null,null,null,"20.40-1","","Fabricação de fibras artificiais e sintéticas",null,null,null,"",".","","--",".--",""]
[null,null,null,null,"20.40-1-00","Fabricação de fibras artificiais e sintéticas",null,null,null,"20.4","20..4","1-00","-1-00","20..4-1-00","20..4-1-00"]
[null,null,"20.5",null,"","Fabricação de defensivos agrícolas e desinfestantes domissanitários",null,null,null,"",".","","--",".--",""]
[null,null,null,"20.51-7","","Fabricação de defensivos agrícolas",null,null,null,"",".","","--",".--",""]
[null,null,null,null,"20.51-7-00","Fabricação de defensivos agrícolas",null,null,null,"20.5","20..5","7-00","-7-00","20..5-7-00","20..5-7-00"]
[null,null,null,"20.52-5","","Fabricação de desinfestantes domissanitários",null,null,null,"",".","","--",".--",""]
[null,null,null,null,"20.52-5-00","Fabricação de desinfestantes domissanitários",null,null,null,"20.5","20..5","5-00","-5-00","20..5-5-00","20..5-5-00"]
[null,null,"20.6",null,"","Fabricação de sabões, detergentes, produtos de limpeza, cosméticos, produtos de perfumaria e de higiene pessoal",null,null,null,"",".","","--",".--",""]
[null,null,null,"20.61-4","","Fabricação de sabões e detergentes sintéticos",null,null,null,"",".","","--",".--",""]
[null,null,null,null,"20.61-4-00","Fabricação de sabões e detergentes sintéticos",null,null,null,"20.6","20..6","4-00","-4-00","20..6-4-00","20..6-4-00"]
[null,null,null,"20.62-2","","Fabricação de produtos de limpeza e polimento",null,null,null,"",".","","--",".--",""]
[null,null,null,null,"20.62-2-00","Fabricação de produtos de limpeza e polimento",null,null,null,"20.6","20..6","2-00","-2-00","20..6-2-00","20..6-2-00"]
[null,null,null,"20.63-1","","Fabricação de cosméticos, produtos de perfumaria e de higiene pessoal",null,null,null,"",".","","--",".--",""]
[null,null,null,null,"20.63-1-00","Fabricação de cosméticos, produtos de perfumaria e de higiene pessoal",null,null,null,"20.6","20..6","1-00","-1-00","20..6-1-00","20..6-1-00"]
[null,null,"20.7",null,"","Fabricação de tintas, vernizes, esmaltes, lacas e produtos afins",null,null,null,"",".","","--",".--",""]
[null,null,null,"20.71-1","","Fabricação de tintas, vernizes, esmaltes e lacas",null,null,null,"",".","","--",".--",""]
[null,null,null,null,"20.71-1-00","Fabricação de tintas, vernizes, esmaltes e lacas",null,null,null,{"$f":"LEFT(E583,4)","v":"20.7"},{"$f":"CONCATENATE(LEFT(J583,2),\".\",RIGHT(J583,2))","v":"20..7"},{"$f":"RIGHT(E583,4)","v":"1-00"},{"$f":"CONCATENATE(\"-\",LEFT(L583,1),\"-\",RIGHT(L583,2))","v":"-1-00"},{"$f":"CONCATENATE(K583,M583)","v":"20..7-1-00"},"20..7-1-00"]
[null,null,null,"20.72-0","","Fabricação de tintas de impressão",null,null,null,"",".","","--",".--",""]
[null,null,null,null,"20.72-0-00","Fabricação de tintas de impressão",null,null,null,"20.7","20..7","0-00","-0-00","20..7-0-00","20..7-0-00"]
[null,null,null,"20.73-8","","Fabricação de impermeabilizantes, solventes e produtos afins",null,null,null,"",".","","--",".--",""]
[null,null,null,null,"20.73-8-00","Fabricação de impermeabilizantes, solventes e produtos afins",null,null,null,"20.7","20..7","8-00","-8-00","20..7-8-00",{"$f":"IF(LEN(N587)=10,N587,\"\")","v":"20..7-8-00"}]
[null,null,"20.9",null,"","Fabricação de produtos e preparados químicos diversos",null,null,null,"",".","","--",".--",""]
[null,null,null,"20.91-6","","Fabricação de adesivos e selantes",null,null,null,"",".","","--",".--",""]
[null,null,null,null,"20.91-6-00","Fabricação de adesivos e selantes",null,null,null,"20.9","20..9","6-00","-6-00","20..9-6-00","20..9-6-00"]
[null,null,null,"20.92-4","","Fabricação de explosivos",null,null,null,"",".","","--",".--",""]
[null,null,null,null,"20.92-4-01","Fabricação de pólvoras, explosivos e detonantes",null,null,null,"20.9","20..9","4-01","-4-01","20..9-4-01","20..9-4-01"]
[null,null,null,null,"20.92-4-02","Fabricação de artigos pirotécnicos",null,null,null,"20.9","20..9","4-02","-4-02","20..9-4-02","20..9-4-02"]
[null,null,null,null,"20.92-4-03","Fabricação de fósforos de segurança",null,null,null,"20.9","20..9","4-03","-4-03","20..9-4-03","20..9-4-03"]
[null,null,null,"20.93-2","","Fabricação de aditivos de uso industrial",null,null,null,"",".","","--",".--",""]
[null,null,null,null,"20.93-2-00","Fabricação de aditivos de uso industrial",null,null,null,"20.9","20..9","2-00","-2-00","20..9-2-00","20..9-2-00"]
[null,null,null,"20.94-1","","Fabricação de catalisadores",null,null,null,"",".","","--",".--",""]
[null,null,null,null,"20.94-1-00","Fabricação de catalisadores",null,null,null,"20.9","20..9","1-00","-1-00","20..9-1-00","20..9-1-00"]
[null,null,null,"20.99-1","","Fabricação de produtos químicos não especificados anteriormente",null,null,null,"",".","","--",".--",""]
[null,null,null,null,"20.99-1-01","Fabricação de chapas, filmes, papéis e outros materiais e produtos químicos para fotografia",null,null,null,"20.9","20..9","1-01","-1-01","20..9-1-01","20..9-1-01"]
[null,null,null,null,"20.99-1-99","Fabricação de outros produtos químicos não especificados anteriormente",null,null,null,"20.9","20..9","1-99","-1-99","20..9-1-99","20..9-1-99"]
[null,21,null,null,"","FABRICAÇÃO DE PRODUTOS FARMOQUÍMICOS E FARMACÊUTICOS",null,null,null,"",".","","--",".--",""]
[null,null,"21.1",null,"","Fabricação de produtos farmoquímicos",null,null,null,"",".","","--",".--",""]
[null,null,null,"21.10-6","","Fabricação de produtos farmoquímicos",null,null,null,"",".","","--",".--",""]
[null,null,null,null,"21.10-6-00","Fabricação de produtos farmoquímicos",null,null,null,"21.1","21..1","6-00","-6-00","21..1-6-00","21..1-6-00"]
[null,null,"21.2",null,"","Fabricação de produtos farmacêuticos",null,null,null,"",".","","--",".--",""]
[null,null,null,"21.21-1","","Fabricação de medicamentos para uso humano",null,null,null,"",".","","--",".--",""]
[null,null,null,null,"21.21-1-01","Fabricação de medicamentos alopáticos para uso humano",null,null,null,"21.2","21..2","1-01","-1-01","21..2-1-01","21..2-1-01"]
[null,null,null,null,"21.21-1-02","Fabricação de medicamentos homeopáticos para uso humano",null,null,null,"21.2","21..2","1-02","-1-02","21..2-1-02","21..2-1-02"]
[null,null,null,null,"21.21-1-03","Fabricação de medicamentos fitoterápicos para uso humano",null,null,null,"21.2","21..2","1-03","-1-03","21..2-1-03","21..2-1-03"]
[null,null,null,"21.22-0","","Fabricação de medicamentos para uso veterinário",null,null,null,"",".","","--",".--",""]
[null,null,null,null,"21.22-0-00","Fabricação de medicamentos para uso veterinário",null,null,null,"21.2","21..2","0-00","-0-00","21..2-0-00","21..2-0-00"]
[null,null,null,"21.23-8","","Fabricação de preparações farmacêuticas",null,null,null,"",".","","--",".--",""]
[null,null,null,null,"21.23-8-00","Fabricação de preparações farmacêuticas",null,null,null,"21.2","21..2","8-00","-8-00","21..2-8-00","21..2-8-00"]
[null,"22",null,null,"","FABRICAÇÃO DE PRODUTOS DE BORRACHA E DE MATERIAL PLÁSTICO",null,null,null,"",".","","--",".--",""]
[null,null,"22.1",null,"","Fabricação de produtos de borracha",null,null,null,"",".","","--",".--",""]
[null,null,null,"22.11-1","","Fabricação de pneumáticos e de câmaras-de-ar",null,null,null,"",".","","--",".--",""]
[null,null,null,null,"22.11-1-00","Fabricação de pneumáticos e de câmaras-de-ar",null,null,null,"22.1","22..1","1-00","-1-00","22..1-1-00","22..1-1-00"]
[null,null,null,"22.12-9","","Reforma de pneumáticos usados",null,null,null,"",".","","--",".--",""]
[null,null,null,null,"22.12-9-00","Reforma de pneumáticos usados",null,null,null,"22.1","22..1","9-00","-9-00","22..1-9-00","22..1-9-00"]
[null,null,null,"22.19-6","","Fabricação de artefatos de borracha não especificados anteriormente",null,null,null,"",".","","--",".--",""]
[null,null,null,null,"22.19-6-00","Fabricação de artefatos de borracha não especificados \nanteriormente",null,null,null,"22.1","22..1","6-00","-6-00","22..1-6-00","22..1-6-00"]
[null,null,"22.2",null,"","Fabricação de produtos de material plástico",null,null,null,"",".","","--",".--",""]
[null,null,null,"22.21-8","","Fabricação de laminados planos e tubulares de material plástico",null,null,null,"",".","","--",".--",""]
[null,null,null,null,"22.21-8-00","Fabricação de laminados planos e tubulares de material plástico",null,null,null,"22.2","22..2","8-00","-8-00","22..2-8-00","22..2-8-00"]
[null,null,null,"22.22-6","","Fabricação de embalagens de material plástico",null,null,null,"",".","","--",".--",""]
[null,null,null,null,"22.22-6-00","Fabricação de embalagens de material plástico",null,null,null,"22.2","22..2","6-00","-6-00","22..2-6-00","22..2-6-00"]
[null,null,null,"22.23-4","","Fabricação de tubos e acessórios de material plástico para uso na construção",null,null,null,"",".","","--",".--",""]
[null,null,null,null,"22.23-4-00","Fabricação de tubos e acessórios de material plástico para uso na construção","SIM",null,null,"22.2","22..2","4-00","-4-00","22..2-4-00","22..2-4-00"]
[null,null,null,"22.29-3","","Fabricação de artefatos de material plástico não especificados anteriormente",null,null,null,"",".","","--",".--",""]
[null,null,null,null,"22.29-3-01","Fabricação de artefatos de material plástico para uso pessoal e doméstico",null,null,null,"22.2","22..2","3-01","-3-01","22..2-3-01","22..2-3-01"]
[null,null,null,null,"22.29-3-02","Fabricação de artefatos de material plástico para usos industriais",null,null,null,"22.2","22..2","3-02","-3-02","22..2-3-02","22..2-3-02"]
[null,null,null,null,"22.29-3-03","Fabricação de artefatos de material plástico para uso na construção, exceto tubos e acessórios","SIM",null,null,"22.2","22..2","3-03","-3-03","22..2-3-03","22..2-3-03"]
[null,null,null,null,"22.29-3-99","Fabricação de artefatos de material plástico para outros usos não especificados anteriormente",null,null,null,"22.2","22..2","3-99","-3-99","22..2-3-99","22..2-3-99"]
[null,23,null,null,"","FABRICAÇÃO DE PRODUTOS DE MINERAIS NÃO METÁLICOS",null,null,null,"",".","","--",".--",""]
[null,null,"23.1",null,"","Fabricação de vidro e de produtos do vidro",null,null,null,"",".","","--",".--",""]
[null,null,null,"23.11-7","","Fabricação de vidro plano e de segurança",null,null,null,"",".","","--",".--",""]
[null,null,null,null,"23.11-7-00","Fabricação de vidro plano e de segurança","SIM",null,null,"23.1","23..1","7-00","-7-00","23..1-7-00","23..1-7-00"]
[null,null,null,"23.12-5","","Fabricação de embalagens de vidro",null,null,null,"",".","","--",".--",""]
[null,null,null,null,"23.12-5-00","Fabricação de embalagens de vidro",null,null,null,"23.1","23..1","5-00","-5-00","23..1-5-00","23..1-5-00"]
[null,null,null,"23.19-2","","Fabricação de artigos de vidro",null,null,null,"",".","","--",".--",""]
[null,null,null,null,"23.19-2-00","Fabricação de artigos de vidro",null,null,null,"23.1","23..1","2-00","-2-00","23..1-2-00","23..1-2-00"]
[null,null,"23.2",null,"","Fabricação de cimento",null,null,null,"",".","","--",".--",""]
[null,null,null,"23.20-6","","Fabricação de cimento",null,null,null,"",".","","--",".--",""]
[null,null,null,null,"23.20-6-00","Fabricação de cimento",null,null,null,"23.2","23..2","6-00","-6-00","23..2-6-00","23..2-6-00"]
[null,null,"23.3",null,"","Fabricação de artefatos de concreto, cimento, fibrocimento, gesso e materiais semelhantes",null,null,null,"",".","","--",".--",""]
[null,null,null,"23.30-3","","Fabricação de artefatos de concreto, cimento, fibrocimento, gesso e materiais semelhantes",null,null,null,{"$f":"LEFT(E647,4)","v":""},{"$f":"CONCATENATE(LEFT(J647,2),\".\",RIGHT(J647,2))","v":"."},{"$f":"RIGHT(E647,4)","v":""},{"$f":"CONCATENATE(\"-\",LEFT(L647,1),\"-\",RIGHT(L647,2))","v":"--"},{"$f":"CONCATENATE(K647,M647)","v":".--"},""]
[null,null,null,null,"23.30-3-01","Fabricação de estruturas pré-moldadas de concreto armado, em série e sob encomenda",null,null,null,"23.3","23..3","3-01","-3-01","23..3-3-01","23..3-3-01"]
[null,null,null,null,"23.30-3-02","Fabricação de artefatos de cimento para uso na construção","SIM",null,null,"23.3","23..3","3-02","-3-02","23..3-3-02","23..3-3-02"]
[null,null,null,null,"23.30-3-03","Fabricação de artefatos de fibrocimento para uso na construção","SIM",null,null,"23.3","23..3","3-03","-3-03","23..3-3-03","23..3-3-03"]
[null,null,null,null,"23.30-3-04","Fabricação de casas pré-moldadas de concreto","SIM",null,null,"23.3","23..3","3-04","-3-04","23..3-3-04",{"$f":"IF(LEN(N651)=10,N651,\"\")","v":"23..3-3-04"}]
[null,null,null,null,"23.30-3-05","Preparação de massa de concreto e argamassa para construção","SIM",null,null,"23.3","23..3","3-05","-3-05","23..3-3-05","23..3-3-05"]
[null,null,null,null,"23.30-3-99","Fabricação de outros artefatos e produtos de concreto, cimento, fibrocimento, gesso e materiais semelhantes","SIM",null,null,"23.3","23..3","3-99","-3-99","23..3-3-99","23..3-3-99"]
[null,null,"23.4",null,"","Fabricação de produtos cerâmicos",null,null,null,"",".","","--",".--",""]
[null,null,null,"23.41-9","","Fabricação de produtos cerâmicos refratários",null,null,null,"",".","","--",".--",""]
[null,null,null,null,"23.41-9-00","Fabricação de produtos cerâmicos refratários",null,null,null,"23.4","23..4","9-00","-9-00","23..4-9-00","23..4-9-00"]
[null,null,null,"23.42-7","","Fabricação de produtos cerâmicos não refratários para uso estrutural na construção",null,null,null,"",".","","--",".--",""]
[null,null,null,null,"23.42-7-01","Fabricação de azulejos e pisos","SIM",null,null,"23.4","23..4","7-01","-7-01","23..4-7-01","23..4-7-01"]
[null,null,null,null,"23.42-7-02","Fabricação de artefatos de cerâmica e barro cozido para uso na construção, exceto azulejos e pisos","SIM",null,null,"23.4","23..4","7-02","-7-02","23..4-7-02","23..4-7-02"]
[null,null,null,"23.49-4","","Fabricação de produtos cerâmicos não refratários não especificados anteriormente",null,null,null,"",".","","--",".--",""]
[null,null,null,null,"23.49-4-01","Fabricação de material sanitário de cerâmica","SIM",null,null,"23.4","23..4","4-01","-4-01","23..4-4-01","23..4-4-01"]
[null,null,null,null,"23.49-4-99","Fabricação de produtos cerâmicos não refratários não especificados anteriormente","SIM",null,null,"23.4","23..4","4-99","-4-99","23..4-4-99","23..4-4-99"]
[null,null,"23.9",null,"","Aparelhamento de pedras e fabricação de outros produtos de minerais não metálicos",null,null,null,"",".","","--",".--",""]
[null,null,null,"23.91-5","","Aparelhamento e outros trabalhos em pedras",null,null,null,"",".","","--",".--",""]
[null,null,null,null,"23.91-5-01","Britamento de pedras, exceto associado à extração","SIM",null,null,"23.9","23..9","5-01","-5-01","23..9-5-01","23..9-5-01"]
[null,null,null,null,"23.91-5-02","Aparelhamento de pedras para construção, exceto associado à extração","SIM",null,null,"23.9","23..9","5-02","-5-02","23..9-5-02","23..9-5-02"]
[null,null,null,null,"23.91-5-03","Aparelhamento de placas e execução de trabalhos em mármore, granito, ardósia e outras pedras","SIM",null,null,"23.9","23..9","5-03","-5-03","23..9-5-03","23..9-5-03"]
[null,null,null,"23.92-3","","Fabricação de cal e gesso",null,null,null,"",".","","--",".--",""]
[null,null,null,null,"23.92-3-00","Fabricação de cal e gesso",null,null,null,"23.9","23..9","3-00","-3-00","23..9-3-00","23..9-3-00"]
[null,null,null,"23.99-1","","Fabricação de produtos de minerais não metálicos não especificados anteriormente",null,null,null,"",".","","--",".--",""]
[null,null,null,null,"23.99-1-01","Decoração, lapidação, gravação, vitrificação e outros trabalhos em cerâmica, louça, vidro e cristal",null,null,null,"23.9","23..9","1-01","-1-01","23..9-1-01","23..9-1-01"]
[null,null,null,null,"23.99-1-02","Fabricação de abrasivos",null,null,null,"23.9","23..9","1-02","-1-02","23..9-1-02","23..9-1-02"]
[null,null,null,null,"23.99-1-99","Fabricação de outros produtos de minerais não metálicos não especificados anteriormente",null,null,null,"23.9","23..9","1-99","-1-99","23..9-1-99","23..9-1-99"]
[null,"24",null,null,"","METALURGIA",null,null,null,"",".","","--",".--",""]
[null,null,"24.1",null,"","Produção de ferro-gusa e de ferroligas",null,null,null,"",".","","--",".--",""]
[null,null,null,"24.11-3","","Produção de ferro-gusa",null,null,null,"",".","","--",".--",""]
[null,null,null,null,"24.11-3-00","Produção de ferro-gusa",null,null,null,"24.1","24..1","3-00","-3-00","24..1-3-00","24..1-3-00"]
[null,null,null,"24.12-1","","Produção de ferroligas",null,null,null,"",".","","--",".--",""]
[null,null,null,null,"24.12-1-00","Produção de ferroligas",null,null,null,"24.1","24..1","1-00","-1-00","24..1-1-00","24..1-1-00"]
[null,null,"24.2",null,"","Siderurgia",null,null,null,"",".","","--",".--",""]
[null,null,null,"24.21-1","","Produção de semiacabados de aço",null,null,null,"",".","","--",".--",""]
[null,null,null,null,"24.21-1-00","Produção de semiacabados de aço",null,null,null,"24.2","24..2","1-00","-1-00","24..2-1-00","24..2-1-00"]
[null,null,null,"24.22-9","","Produção de laminados planos de aço",null,null,null,"",".","","--",".--",""]
[null,null,null,null,"24.22-9-01","Produção de laminados planos de aço ao carbono, revestidos ou não",null,null,null,"24.2","24..2","9-01","-9-01","24..2-9-01","24..2-9-01"]
[null,null,null,null,"24.22-9-02","Produção de laminados planos de aços especiais",null,null,null,"24.2","24..2","9-02","-9-02","24..2-9-02","24..2-9-02"]
[null,null,null,"24.23-7","","Produção de laminados longos de aço",null,null,null,"",".","","--",".--",""]
[null,null,null,null,"24.23-7-01","Produção de tubos de aço sem costura",null,null,null,"24.2","24..2","7-01","-7-01","24..2-7-01","24..2-7-01"]
[null,null,null,null,"24.23-7-02","Produção de laminados longos de aço, exceto tubos",null,null,null,"24.2","24..2","7-02","-7-02","24..2-7-02","24..2-7-02"]
[null,null,null,"24.24-5","","Produção de relaminados, trefilados e perfilados de aço",null,null,null,"",".","","--",".--",""]
[null,null,null,null,"24.24-5-01","Produção de arames de aço",null,null,null,"24.2","24..2","5-01","-5-01","24..2-5-01","24..2-5-01"]
[null,null,null,null,"24.24-5-02","Produção de relaminados, trefilados e perfilados de aço, exceto arames",null,null,null,"24.2","24..2","5-02","-5-02","24..2-5-02","24..2-5-02"]
[null,null,"24.3",null,"","Produção de tubos de aço, exceto tubos sem costura",null,null,null,"",".","","--",".--",""]
[null,null,null,"24.31-8","","Produção de tubos de aço com costura",null,null,null,"",".","","--",".--",""]
[null,null,null,null,"24.31-8-00","Produção de tubos de aço com costura",null,null,null,"24.3","24..3","8-00","-8-00","24..3-8-00","24..3-8-00"]
[null,null,null,"24.39-3","","Produção de outros tubos de ferro e aço",null,null,null,"",".","","--",".--",""]
[null,null,null,null,"24.39-3-00","Produção de outros tubos de ferro e aço",null,null,null,"24.3","24..3","3-00","-3-00","24..3-3-00","24..3-3-00"]
[null,null,"24.4",null,"","Metalurgia dos metais não ferrosos",null,null,null,"",".","","--",".--",""]
[null,null,null,"24.41-5","","Metalurgia do alumínio e suas ligas",null,null,null,"",".","","--",".--",""]
[null,null,null,null,"24.41-5-01","Produção de alumínio e suas ligas em formas primárias",null,null,null,"24.4","24..4","5-01","-5-01","24..4-5-01","24..4-5-01"]
[null,null,null,null,"24.41-5-02","Produção de laminados de alumínio",null,null,null,"24.4","24..4","5-02","-5-02","24..4-5-02","24..4-5-02"]
[null,null,null,"24.42-3","","Metalurgia dos metais preciosos",null,null,null,"",".","","--",".--",""]
[null,null,null,null,"24.42-3-00","Metalurgia dos metais preciosos",null,null,null,"24.4","24..4","3-00","-3-00","24..4-3-00","24..4-3-00"]
[null,null,null,"24.43-1","","Metalurgia do cobre",null,null,null,"",".","","--",".--",""]
[null,null,null,null,"24.43-1-00","Metalurgia do cobre",null,null,null,"24.4","24..4","1-00","-1-00","24..4-1-00","24..4-1-00"]
[null,null,null,"24.49-1","","Metalurgia dos metais não ferrosos e suas ligas não especificados anteriormente",null,null,null,"",".","","--",".--",""]
[null,null,null,null,"24.49-1-01","Produção de zinco em formas primárias",null,null,null,"24.4","24..4","1-01","-1-01","24..4-1-01","24..4-1-01"]
[null,null,null,null,"24.49-1-02","Produção de laminados de zinco",null,null,null,"24.4","24..4","1-02","-1-02","24..4-1-02","24..4-1-02"]
[null,null,null,null,"24.49-1-03","Fabricação de ânodos para galvanoplastia",null,null,null,"24.4","24..4","1-03","-1-03","24..4-1-03","24..4-1-03"]
[null,null,null,null,"24.49-1-99","Metalurgia de outros metais não ferrosos e suas ligas não especificados anteriormente",null,null,null,"24.4","24..4","1-99","-1-99","24..4-1-99","24..4-1-99"]
[null,null,"24.5",null,"","Fundição",null,null,null,"",".","","--",".--",""]
[null,null,null,"24.51-2","","Fundição de ferro e aço",null,null,null,{"$f":"LEFT(E711,4)","v":""},{"$f":"CONCATENATE(LEFT(J711,2),\".\",RIGHT(J711,2))","v":"."},{"$f":"RIGHT(E711,4)","v":""},{"$f":"CONCATENATE(\"-\",LEFT(L711,1),\"-\",RIGHT(L711,2))","v":"--"},{"$f":"CONCATENATE(K711,M711)","v":".--"},""]
[null,null,null,null,"24.51-2-00","Fundição de ferro e aço",null,null,null,"24.5","24..5","2-00","-2-00","24..5-2-00","24..5-2-00"]
[null,null,null,"24.52-1","","Fundição de metais não ferrosos e suas ligas",null,null,null,"",".","","--",".--",""]
[null,null,null,null,"24.52-1-00","Fundição de metais não ferrosos e suas ligas",null,null,null,"24.5","24..5","1-00","-1-00","24..5-1-00","24..5-1-00"]
[null,"25",null,null,"","FABRICAÇÃO DE PRODUTOS DE METAL, EXCETO MÁQUINAS\nE EQUIPAMENTOS",null,null,null,"",".","","--",".--",{"$f":"IF(LEN(N715)=10,N715,\"\")","v":""}]
[null,null,"25.1",null,"","Fabricação de estruturas metálicas e obras de caldeiraria\npesada",null,null,null,"",".","","--",".--",""]
[null,null,null,"25.11-0","","Fabricação de estruturas metálicas",null,null,null,"",".","","--",".--",""]
[null,null,null,null,"25.11-0-00","Fabricação de estruturas metálicas",null,null,null,"25.1","25..1","0-00","-0-00","25..1-0-00","25..1-0-00"]
[null,null,null,"25.12-8","","Fabricação de esquadrias de metal",null,null,null,"",".","","--",".--",""]
[null,null,null,null,"25.12-8-00","Fabricação de esquadrias de metal",null,null,null,"25.1","25..1","8-00","-8-00","25..1-8-00","25..1-8-00"]
[null,null,null,"25.13-6","","Fabricação de obras de caldeiraria pesada",null,null,null,"",".","","--",".--",""]
[null,null,null,null,"25.13-6-00","Fabricação de obras de caldeiraria pesada",null,null,null,"25.1","25..1","6-00","-6-00","25..1-6-00","25..1-6-00"]
[null,null,"25.2",null,"","Fabricação de tanques, reservatórios metálicos e caldeiras",null,null,null,"",".","","--",".--",""]
[null,null,null,"25.21-7","","Fabricação de tanques, reservatórios metálicos e caldeiras para aquecimento central",null,null,null,"",".","","--",".--",""]
[null,null,null,null,"25.21-7-00","Fabricação de tanques, reservatórios metálicos e caldeiras para aquecimento central",null,null,null,"25.2","25..2","7-00","-7-00","25..2-7-00","25..2-7-00"]
[null,null,null,"25.22-5","","Fabricação de caldeiras geradoras de vapor, exceto para aquecimento central e para veículos",null,null,null,"",".","","--",".--",""]
[null,null,null,null,"25.22-5-00","Fabricação de caldeiras geradoras de vapor, exceto para aquecimento central e para veículos",null,null,null,"25.2","25..2","5-00","-5-00","25..2-5-00","25..2-5-00"]
[null,null,"25.3",null,"","Forjaria, estamparia, metalurgia do pó e serviços de tratamento de metais",null,null,null,"",".","","--",".--",""]
[null,null,null,"25.31-4","","Produção de forjados de aço e de metais não ferrosos e suas ligas",null,null,null,"",".","","--",".--",""]
[null,null,null,null,"25.31-4-01","Produção de forjados de aço",null,null,null,"25.3","25..3","4-01","-4-01","25..3-4-01","25..3-4-01"]
[null,null,null,null,"25.31-4-02","Produção de forjados de metais não ferrosos e suas ligas",null,null,null,"25.3","25..3","4-02","-4-02","25..3-4-02","25..3-4-02"]
[null,null,null,"25.32-2","","Produção de artefatos estampados de metal; metalurgia do pó",null,null,null,"",".","","--",".--",""]
[null,null,null,null,"25.32-2-01","Produção de artefatos estampados de metal",null,null,null,"25.3","25..3","2-01","-2-01","25..3-2-01","25..3-2-01"]
[null,null,null,null,"25.32-2-02","Metalurgia do pó",null,null,null,"25.3","25..3","2-02","-2-02","25..3-2-02","25..3-2-02"]
[null,null,null,"25.39-0","","Serviços de usinagem, solda, tratamento e revestimento em metais",null,null,null,"",".","","--",".--",""]
[null,null,null,null,"25.39-0-01","Serviços de usinagem, torneiria e solda",null,null,null,"25.3","25..3","0-01","-0-01","25..3-0-01","25..3-0-01"]
[null,null,null,null,"25.39-0-02","Serviços de tratamento e revestimento em metais",null,null,null,"25.3","25..3","0-02","-0-02","25..3-0-02","25..3-0-02"]
[null,null,"25.4",null,"","Fabricação de artigos de cutelaria, de serralheria e ferramentas",null,null,null,"",".","","--",".--",""]
[null,null,null,"25.41-1","","Fabricação de artigos de cutelaria",null,null,null,"",".","","--",".--",""]
[null,null,null,null,"25.41-1-00","Fabricação de artigos de cutelaria",null,null,null,"25.4","25..4","1-00","-1-00","25..4-1-00","25..4-1-00"]
[null,null,null,"25.42-0","","Fabricação de artigos de serralheria, exceto esquadrias",null,null,null,"",".","","--",".--",""]
[null,null,null,null,"25.42-0-00","Fabricação de artigos de serralheria, exceto esquadrias",null,null,null,"25.4","25..4","0-00","-0-00","25..4-0-00","25..4-0-00"]
[null,null,null,"25.43-8","","Fabricação de ferramentas",null,null,null,"",".","","--",".--",""]
[null,null,null,null,"25.43-8-00","Fabricação de ferramentas",null,null,null,"25.4","25..4","8-00","-8-00","25..4-8-00","25..4-8-00"]
[null,null,"25.5",null,"","Fabricação de equipamento bélico pesado, armas e munições",null,null,null,"",".","","--",".--",""]
[null,null,null,"25.50-1","","Fabricação de equipamento bélico pesado, armas de fogo e munições",null,null,null,"",".","","--",".--",""]
[null,null,null,null,"25.50-1-01","Fabricação de equipamento bélico pesado, exceto veículos militares de combate",null,null,null,"25.5","25..5","1-01","-1-01","25..5-1-01","25..5-1-01"]
[null,null,null,null,"25.50-1-02","Fabricação de armas de fogo, outras armas e munições",null,null,null,"25.5","25..5","1-02","-1-02","25..5-1-02","25..5-1-02"]
[null,null,"25.9",null,"","Fabricação de produtos de metal não especificados anteriormente",null,null,null,"",".","","--",".--",""]
[null,null,null,"25.91-8","","Fabricação de embalagens metálicas",null,null,null,"",".","","--",".--",""]
[null,null,null,null,"25.91-8-00","Fabricação de embalagens metálicas",null,null,null,"25.9","25..9","8-00","-8-00","25..9-8-00","25..9-8-00"]
[null,null,null,"25.92-6","","Fabricação de produtos de trefilados de metal",null,null,null,"",".","","--",".--",""]
[null,null,null,null,"25.92-6-01","Fabricação de produtos de trefilados de metal padronizados",null,null,null,"25.9","25..9","6-01","-6-01","25..9-6-01","25..9-6-01"]
[null,null,null,null,"25.92-6-02","Fabricação de produtos de trefilados de metal, exceto padronizados",null,null,null,"25.9","25..9","6-02","-6-02","25..9-6-02","25..9-6-02"]
[null,null,null,"25.93-4","","Fabricação de artigos de metal para uso doméstico e pessoal",null,null,null,"",".","","--",".--",""]
[null,null,null,null,"25.93-4-00","Fabricação de artigos de metal para uso doméstico e pessoal",null,null,null,"25.9","25..9","4-00","-4-00","25..9-4-00","25..9-4-00"]
[null,null,null,"25.99-3","","Fabricação de produtos de metal não especificados anteriormente",null,null,null,"",".","","--",".--",""]
[null,null,null,null,"25.99-3-01","Serviços de confecção de armações metálicas para a construção","SIM",null,null,"25.9","25..9","3-01","-3-01","25..9-3-01","25..9-3-01"]
[null,null,null,null,"25.99-3-02","Serviço de corte e dobra de metais","SIM",null,null,"25.9","25..9","3-02","-3-02","25..9-3-02","25..9-3-02"]
[null,null,null,null,"25.99-3-99","Fabricação de outros produtos de metal não especificados anteriormente","SIM",null,null,"25.9","25..9","3-99","-3-99","25..9-3-99","25..9-3-99"]
[null,"26",null,null,"","FABRICAÇÃO DE EQUIPAMENTOS DE INFORMÁTICA, PRODUTOS ELETRÔNICOS E ÓPTICOS",null,null,null,"",".","","--",".--",""]
[null,null,"26.1",null,"","Fabricação de componentes eletrônicos",null,null,null,"",".","","--",".--",""]
[null,null,null,"26.10-8","","Fabricação de componentes eletrônicos",null,null,null,"",".","","--",".--",""]
[null,null,null,null,"26.10-8-00","Fabricação de componentes eletrônicos",null,null,null,"26.1","26..1","8-00","-8-00","26..1-8-00","26..1-8-00"]
[null,null,"26.2",null,"","Fabricação de equipamentos de informática e periféricos",null,null,null,"",".","","--",".--",""]
[null,null,null,"26.21-3","","Fabricação de equipamentos de informática",null,null,null,"",".","","--",".--",""]
[null,null,null,null,"26.21-3-00","Fabricação de equipamentos de informática",null,null,null,"26.2","26..2","3-00","-3-00","26..2-3-00","26..2-3-00"]
[null,null,null,"26.22-1","","Fabricação de periféricos para equipamentos de informática",null,null,null,"",".","","--",".--",""]
[null,null,null,null,"26.22-1-00","Fabricação de periféricos para equipamentos de informática",null,null,null,"26.2","26..2","1-00","-1-00","26..2-1-00","26..2-1-00"]
[null,null,"26.3",null,"","Fabricação de equipamentos de comunicação",null,null,null,"",".","","--",".--",""]
[null,null,null,"26.31-1","","Fabricação de equipamentos transmissores de comunicação",null,null,null,"",".","","--",".--",""]
[null,null,null,null,"26.31-1-00","Fabricação de equipamentos transmissores de comunicação, peças e acessórios",null,null,null,"26.3","26..3","1-00","-1-00","26..3-1-00","26..3-1-00"]
[null,null,null,"26.32-9","","Fabricação de aparelhos telefônicos e de outros equipamentos de comunicação",null,null,null,"",".","","--",".--",""]
[null,null,null,null,"26.32-9-00","Fabricação de aparelhos telefônicos e de outros equipamentos de comunicação, peças e acessórios",null,null,null,"26.3","26..3","9-00","-9-00","26..3-9-00","26..3-9-00"]
[null,null,"26.4",null,"","Fabricação de aparelhos de recepção, reprodução, gravação e amplificação de áudio e vídeo",null,null,null,{"$f":"LEFT(E775,4)","v":""},{"$f":"CONCATENATE(LEFT(J775,2),\".\",RIGHT(J775,2))","v":"."},{"$f":"RIGHT(E775,4)","v":""},{"$f":"CONCATENATE(\"-\",LEFT(L775,1),\"-\",RIGHT(L775,2))","v":"--"},{"$f":"CONCATENATE(K775,M775)","v":".--"},""]
[null,null,null,"26.40-0","","Fabricação de aparelhos de recepção, reprodução, gravação e amplificação de áudio e vídeo",null,null,null,"",".","","--",".--",""]
[null,null,null,null,"26.40-0-00","Fabricação de aparelhos de recepção, reprodução, gravação e amplificação de áudio e vídeo",null,null,null,"26.4","26..4","0-00","-0-00","26..4-0-00","26..4-0-00"]
[null,null,"26.5",null,"","Fabricação de aparelhos e instrumentos de medida, teste e controle; cronômetros e relógios",null,null,null,"",".","","--",".--",""]
[null,null,null,"26.51-5","","Fabricação de aparelhos e equipamentos de medida, teste e\ncontrole",null,null,null,"",".","","--",".--",{"$f":"IF(LEN(N779)=10,N779,\"\")","v":""}]
[null,null,null,null,"26.51-5-00","Fabricação de aparelhos e equipamentos de medida, teste e controle",null,null,null,"26.5","26..5","5-00","-5-00","26..5-5-00","26..5-5-00"]
[null,null,null,"26.52-3","","Fabricação de cronômetros e relógios",null,null,null,"",".","","--",".--",""]
[null,null,null,null,"26.52-3-00","Fabricação de cronômetros e relógios",null,null,null,"26.5","26..5","3-00","-3-00","26..5-3-00","26..5-3-00"]
[null,null,"26.6",null,"","Fabricação de aparelhos eletromédicos e eletroterapêuticos e equipamentos de irradiação",null,null,null,"",".","","--",".--",""]
[null,null,null,"26.60-4","","Fabricação de aparelhos eletromédicos e eletroterapêuticos e equipamentos de irradiação",null,null,null,"",".","","--",".--",""]
[null,null,null,null,"26.60-4-00","Fabricação de aparelhos eletromédicos e eletroterapêuticos e equipamentos de irradiação",null,null,null,"26.6","26..6","4-00","-4-00","26..6-4-00","26..6-4-00"]
[null,null,"26.7",null,"","Fabricação de equipamentos e instrumentos ópticos, fotográficos e cinematográficos",null,null,null,"",".","","--",".--",""]
[null,null,null,"26.70-1","","Fabricação de equipamentos e instrumentos ópticos, fotográficos e cinematográficos",null,null,null,"",".","","--",".--",""]
[null,null,null,null,"26.70-1-01","Fabricação de equipamentos e instrumentos ópticos, peças e acessórios",null,null,null,"26.7","26..7","1-01","-1-01","26..7-1-01","26..7-1-01"]
[null,null,null,null,"26.70-1-02","Fabricação de aparelhos fotográficos e cinematográficos, peças e acessórios",null,null,null,"26.7","26..7","1-02","-1-02","26..7-1-02","26..7-1-02"]
[null,null,"26.8",null,"","Fabricação de mídias virgens, magnéticas e ópticas",null,null,null,"",".","","--",".--",""]
[null,null,null,"26.80-9","","Fabricação de mídias virgens, magnéticas e ópticas",null,null,null,"",".","","--",".--",""]
[null,null,null,null,"26.80-9-00","Fabricação de mídias virgens, magnéticas e ópticas",null,null,null,"26.8","26..8","9-00","-9-00","26..8-9-00","26..8-9-00"]
[null,"27",null,null,"","FABRICAÇÃO DE MÁQUINAS, APARELHOS E MATERIAIS ELÉTRICOS",null,null,null,"",".","","--",".--",""]
[null,null,"27.1",null,"","Fabricação de geradores, transformadores e motores elétricos",null,null,null,"",".","","--",".--",""]
[null,null,null,"27.10-4","","Fabricação de geradores, transformadores e motores elétricos",null,null,null,"",".","","--",".--",""]
[null,null,null,null,"27.10-4-01","Fabricação de geradores de corrente contínua e alternada, peças e acessórios",null,null,null,"27.1","27..1","4-01","-4-01","27..1-4-01","27..1-4-01"]
[null,null,null,null,"27.10-4-02","Fabricação de transformadores, indutores, conversores, sincronizadores e semelhantes, peças e acessórios",null,null,null,"27.1","27..1","4-02","-4-02","27..1-4-02","27..1-4-02"]
[null,null,null,null,"27.10-4-03","Fabricação de motores elétricos, peças e acessórios",null,null,null,"27.1","27..1","4-03","-4-03","27..1-4-03","27..1-4-03"]
[null,null,"27.2",null,"","Fabricação de pilhas, baterias e acumuladores elétricos",null,null,null,"",".","","--",".--",""]
[null,null,null,"27.21-0","","Fabricação de pilhas, baterias e acumuladores elétricos, exceto para veículos automotores",null,null,null,"",".","","--",".--",""]
[null,null,null,null,"27.21-0-00","Fabricação de pilhas, baterias e acumuladores elétricos, exceto para veículos automotores",null,null,null,"27.2","27..2","0-00","-0-00","27..2-0-00","27..2-0-00"]
[null,null,null,"27.22-8","","Fabricação de baterias e acumuladores para veículos automotores",null,null,null,"",".","","--",".--",""]
[null,null,null,null,"27.22-8-01","Fabricação de baterias e acumuladores para veículos automotores",null,null,null,"27.2","27..2","8-01","-8-01","27..2-8-01","27..2-8-01"]
[null,null,null,null,"27.22-8-02","Recondicionamento de baterias e acumuladores para veículos automotores",null,null,null,"27.2","27..2","8-02","-8-02","27..2-8-02","27..2-8-02"]
[null,null,"27.3",null,"","Fabricação de equipamentos para distribuição e controle de energia elétrica",null,null,null,"",".","","--",".--",""]
[null,null,null,"27.31-7","","Fabricação de aparelhos e equipamentos para distribuição e controle de energia elétrica",null,null,null,"",".","","--",".--",""]
[null,null,null,null,"27.31-7-00","Fabricação de aparelhos e equipamentos para distribuição e controle de energia elétrica",null,null,null,"27.3","27..3","7-00","-7-00","27..3-7-00","27..3-7-00"]
[null,null,null,"27.32-5","","Fabricação de material elétrico para instalações em circuito de consumo",null,null,null,"",".","","--",".--",""]
[null,null,null,null,"27.32-5-00","Fabricação de material elétrico para instalações em circuito de consumo",null,null,null,"27.3","27..3","5-00","-5-00","27..3-5-00","27..3-5-00"]
[null,null,null,"27.33-3","","Fabricação de fios, cabos e condutores elétricos isolados",null,null,null,"",".","","--",".--",""]
[null,null,null,null,"27.33-3-00","Fabricação de fios, cabos e condutores elétricos isolados",null,null,null,"27.3","27..3","3-00","-3-00","27..3-3-00","27..3-3-00"]
[null,null,"27.4",null,"","Fabricação de lâmpadas e outros equipamentos de iluminação",null,null,null,"",".","","--",".--",""]
[null,null,null,"27.40-6","","Fabricação de lâmpadas e outros equipamentos de iluminação",null,null,null,"",".","","--",".--",""]
[null,null,null,null,"27.40-6-01","Fabricação de lâmpadas",null,null,null,"27.4","27..4","6-01","-6-01","27..4-6-01","27..4-6-01"]
[null,null,null,null,"27.40-6-02","Fabricação de luminárias e outros equipamentos de iluminação",null,null,null,"27.4","27..4","6-02","-6-02","27..4-6-02","27..4-6-02"]
[null,null,"27.5",null,"","Fabricação de eletrodomésticos",null,null,null,"",".","","--",".--",""]
[null,null,null,"27.51-1","","Fabricação de fogões, refrigeradores e máquinas de lavar e secar para uso doméstico",null,null,null,"",".","","--",".--",""]
[null,null,null,null,"27.51-1-00","Fabricação de fogões, refrigeradores e máquinas de lavar e secar para uso doméstico, peças e acessórios",null,null,null,"27.5","27..5","1-00","-1-00","27..5-1-00","27..5-1-00"]
[null,null,null,"27.59-7","","Fabricação de aparelhos eletrodomésticos não especificados anteriormente",null,null,null,"",".","","--",".--",""]
[null,null,null,null,"27.59-7-01","Fabricação de aparelhos elétricos de uso pessoal, peças e acessórios",null,null,null,"27.5","27..5","7-01","-7-01","27..5-7-01","27..5-7-01"]
[null,null,null,null,"27.59-7-99","Fabricação de outros aparelhos eletrodomésticos não especificados anteriormente, peças e acessórios",null,null,null,"27.5","27..5","7-99","-7-99","27..5-7-99","27..5-7-99"]
[null,null,"27.9",null,"","Fabricação de equipamentos e aparelhos elétricos não especificados anteriormente",null,null,null,"",".","","--",".--",""]
[null,null,null,"27.90-2","","Fabricação de equipamentos e aparelhos elétricos não especificados anteriormente",null,null,null,"",".","","--",".--",""]
[null,null,null,null,"27.90-2-01","Fabricação de eletrodos, contatos e outros artigos de carvão e grafita para uso elétrico, eletroímãs e isoladores",null,null,null,"27.9","27..9","2-01","-2-01","27..9-2-01","27..9-2-01"]
[null,null,null,null,"27.90-2-02","Fabricação de equipamentos para sinalização e alarme",null,null,null,"27.9","27..9","2-02","-2-02","27..9-2-02","27..9-2-02"]
[null,null,null,null,"27.90-2-99","Fabricação de outros equipamentos e aparelhos elétricos não especificados anteriormente",null,null,null,"27.9","27..9","2-99","-2-99","27..9-2-99","27..9-2-99"]
[null,"28",null,null,"","FABRICAÇÃO DE MÁQUINAS E EQUIPAMENTOS",null,null,null,"",".","","--",".--",""]
[null,null,"28.1",null,"","Fabricação de motores, bombas, compressores e equipamentos de transmissão",null,null,null,"",".","","--",".--",""]
[null,null,null,"28.11-9","","Fabricação de motores e turbinas, exceto para aviões e veículos rodoviários",null,null,null,"",".","","--",".--",""]
[null,null,null,null,"28.11-9-00","Fabricação de motores e turbinas, peças e acessórios, exceto para aviões e veículos rodoviários",null,null,null,"28.1","28..1","9-00","-9-00","28..1-9-00","28..1-9-00"]
[null,null,null,"28.12-7","","Fabricação de equipamentos hidráulicos e pneumáticos, exceto válvulas",null,null,null,"",".","","--",".--",""]
[null,null,null,null,"28.12-7-00","Fabricação de equipamentos hidráulicos e pneumáticos, peças e acessórios, exceto válvulas",null,null,null,"28.1","28..1","7-00","-7-00","28..1-7-00","28..1-7-00"]
[null,null,null,"28.13-5","","Fabricação de válvulas, registros e dispositivos semelhantes",null,null,null,"",".","","--",".--",""]
[null,null,null,null,"28.13-5-00","Fabricação de válvulas, registros e dispositivos semelhantes, peças e acessórios",null,null,null,"28.1","28..1","5-00","-5-00","28..1-5-00","28..1-5-00"]
[null,null,null,"28.14-3","","Fabricação de compressores",null,null,null,"",".","","--",".--",""]
[null,null,null,null,"28.14-3-01","Fabricação de compressores para uso industrial, peças e acessórios",null,null,null,"28.1","28..1","3-01","-3-01","28..1-3-01","28..1-3-01"]
[null,null,null,null,"28.14-3-02","Fabricação de compressores para uso não industrial, peças e acessórios",null,null,null,"28.1","28..1","3-02","-3-02","28..1-3-02","28..1-3-02"]
[null,null,null,"28.15-1","","Fabricação de equipamentos de transmissão para fins industriais",null,null,null,"",".","","--",".--",""]
[null,null,null,null,"28.15-1-01","Fabricação de rolamentos para fins industriais",null,null,null,{"$f":"LEFT(E839,4)","v":"28.1"},{"$f":"CONCATENATE(LEFT(J839,2),\".\",RIGHT(J839,2))","v":"28..1"},{"$f":"RIGHT(E839,4)","v":"1-01"},{"$f":"CONCATENATE(\"-\",LEFT(L839,1),\"-\",RIGHT(L839,2))","v":"-1-01"},{"$f":"CONCATENATE(K839,M839)","v":"28..1-1-01"},"28..1-1-01"]
[null,null,null,null,"28.15-1-02","Fabricação de equipamentos de transmissão para fins industriais, exceto rolamentos",null,null,null,"28.1","28..1","1-02","-1-02","28..1-1-02","28..1-1-02"]
[null,null,"28.2",null,"","Fabricação de máquinas e equipamentos de uso geral",null,null,null,"",".","","--",".--",""]
[null,null,null,"28.21-6","","Fabricação de aparelhos e equipamentos para instalações térmicas",null,null,null,"",".","","--",".--",""]
[null,null,null,null,"28.21-6-01","Fabricação de fornos industriais, aparelhos e equipamentos não elétricos para instalações térmicas, peças e acessórios",null,null,null,"28.2","28..2","6-01","-6-01","28..2-6-01",{"$f":"IF(LEN(N843)=10,N843,\"\")","v":"28..2-6-01"}]
[null,null,null,null,"28.21-6-02","Fabricação de estufas e fornos elétricos para fins industriais, peças e acessórios",null,null,null,"28.2","28..2","6-02","-6-02","28..2-6-02","28..2-6-02"]
[null,null,null,"28.22-4","","Fabricação de máquinas, equipamentos e aparelhos para transporte e elevação de cargas e pessoas",null,null,null,"",".","","--",".--",""]
[null,null,null,null,"28.22-4-01","Fabricação de máquinas, equipamentos e aparelhos para transporte e elevação de pessoas, peças e acessórios",null,null,null,"28.2","28..2","4-01","-4-01","28..2-4-01","28..2-4-01"]
[null,null,null,null,"28.22-4-02","Fabricação de máquinas, equipamentos e aparelhos para transporte e elevação de cargas, peças e acessórios",null,null,null,"28.2","28..2","4-02","-4-02","28..2-4-02","28..2-4-02"]
[null,null,null,"28.23-2","","Fabricação de máquinas e aparelhos de refrigeração e ventilação para uso industrial e comercial",null,null,null,"",".","","--",".--",""]
[null,null,null,null,"28.23-2-00","Fabricação de máquinas e aparelhos de refrigeração e ventilação para uso industrial e comercial, peças e acessórios",null,null,null,"28.2","28..2","2-00","-2-00","28..2-2-00","28..2-2-00"]
[null,null,null,"28.24-1","","Fabricação de aparelhos e equipamentos de ar condicionado",null,null,null,"",".","","--",".--",""]
[null,null,null,null,"28.24-1-01","Fabricação de aparelhos e equipamentos de ar condicionado para uso industrial",null,null,null,"28.2","28..2","1-01","-1-01","28..2-1-01","28..2-1-01"]
[null,null,null,null,"28.24-1-02","Fabricação de aparelhos e equipamentos de ar condicionado para uso não industrial",null,null,null,"28.2","28..2","1-02","-1-02","28..2-1-02","28..2-1-02"]
[null,null,null,"28.25-9","","Fabricação de máquinas e equipamentos para saneamento básico e ambiental",null,null,null,"",".","","--",".--",""]
[null,null,null,null,"28.25-9-00","Fabricação de máquinas e equipamentos para saneamento básico e ambiental, peças e acessórios",null,null,null,"28.2","28..2","9-00","-9-00","28..2-9-00","28..2-9-00"]
[null,null,null,"28.29-1","","Fabricação de máquinas e equipamentos de uso geral não especificados anteriormente",null,null,null,"",".","","--",".--",""]
[null,null,null,null,"28.29-1-01","Fabricação de máquinas de escrever, calcular e outros equipamentos não eletrônicos para escritório, peças e acessórios",null,null,null,"28.2","28..2","1-01","-1-01","28..2-1-01","28..2-1-01"]
[null,null,null,null,"28.29-1-99","Fabricação de outras máquinas e equipamentos de uso geral não especificados anteriormente, peças e acessórios",null,null,null,"28.2","28..2","1-99","-1-99","28..2-1-99","28..2-1-99"]
[null,null,"28.3",null,"","Fabricação de tratores e de máquinas e equipamentos para a agricultura e pecuária",null,null,null,"",".","","--",".--",""]
[null,null,null,"28.31-3","","Fabricação de tratores agrícolas",null,null,null,"",".","","--",".--",""]
[null,null,null,null,"28.31-3-00","Fabricação de tratores agrícolas, peças e acessórios",null,null,null,"28.3","28..3","3-00","-3-00","28..3-3-00","28..3-3-00"]
[null,null,null,"28.32-1","","Fabricação de equipamentos para irrigação agrícola",null,null,null,"",".","","--",".--",""]
[null,null,null,null,"28.32-1-00","Fabricação de equipamentos para irrigação agrícola, peças e acessórios",null,null,null,"28.3","28..3","1-00","-1-00","28..3-1-00","28..3-1-00"]
[null,null,null,"28.33-0","","Fabricação de máquinas e equipamentos para a agricultura e pecuária, exceto para irrigação",null,null,null,"",".","","--",".--",""]
[null,null,null,null,"28.33-0-00","Fabricação de máquinas e equipamentos para a agricultura e pecuária, peças e acessórios, exceto para irrigação",null,null,null,"28.3","28..3","0-00","-0-00","28..3-0-00","28..3-0-00"]
[null,null,"28.4",null,"","Fabricação de máquinas-ferramenta",null,null,null,"",".","","--",".--",""]
[null,null,null,"28.40-2","","Fabricação de máquinas-ferramenta",null,null,null,"",".","","--",".--",""]
[null,null,null,null,"28.40-2-00","Fabricação de máquinas-ferramenta, peças e acessórios",null,null,null,"28.4","28..4","2-00","-2-00","28..4-2-00","28..4-2-00"]
[null,null,"28.5",null,"","Fabricação de máquinas e equipamentos de uso na extração mineral e na construção",null,null,null,"",".","","--",".--",""]
[null,null,null,"28.51-8","","Fabricação de máquinas e equipamentos para a prospecção e extração de petróleo",null,null,null,"",".","","--",".--",""]
[null,null,null,null,"28.51-8-00","Fabricação de máquinas e equipamentos para a prospecção e extração de petróleo, peças e acessórios",null,null,null,"28.5","28..5","8-00","-8-00","28..5-8-00","28..5-8-00"]
[null,null,null,"28.52-6","","Fabricação de outras máquinas e equipamentos para uso na extração mineral, exceto na extração de petróleo",null,null,null,"",".","","--",".--",""]
[null,null,null,null,"28.52-6-00","Fabricação de outras máquinas e equipamentos para uso na extração mineral, peças e acessórios, exceto na extração de petróleo",null,null,null,"28.5","28..5","6-00","-6-00","28..5-6-00","28..5-6-00"]
[null,null,null,"28.53-4","","Fabricação de tratores, exceto agrícolas",null,null,null,"",".","","--",".--",""]
[null,null,null,null,"28.53-4-00","Fabricação de tratores, peças e acessórios, exceto agrícolas",null,null,null,"28.5","28..5","4-00","-4-00","28..5-4-00","28..5-4-00"]
[null,null,null,"28.54-2","","Fabricação de máquinas e equipamentos para terraplenagem, pavimentação e construção, exceto tratores",null,null,null,"",".","","--",".--",""]
[null,null,null,null,"28.54-2-00","Fabricação de máquinas e equipamentos para terraplenagem, pavimentação e construção, peças e acessórios, exceto tratores","SIM",null,null,"28.5","28..5","2-00","-2-00","28..5-2-00","28..5-2-00"]
[null,null,"28.6",null,"","Fabricação de máquinas e equipamentos de uso industrial específico",null,null,null,"",".","","--",".--",""]
[null,null,null,"28.61-5","","Fabricação de máquinas para a indústria metalúrgica, exceto máquinas-ferramenta",null,null,null,"",".","","--",".--",""]
[null,null,null,null,"28.61-5-00","Fabricação de máquinas para a indústria metalúrgica, peças e acessórios, exceto máquinas-ferramenta",null,null,null,"28.6","28..6","5-00","-5-00","28..6-5-00","28..6-5-00"]
[null,null,null,"28.62-3","","Fabricação de máquinas e equipamentos para as indústrias de alimentos, bebidas e fumo",null,null,null,"",".","","--",".--",""]
[null,null,null,null,"28.62-3-00","Fabricação de máquinas e equipamentos para as indústrias de alimentos, bebidas e fumo, peças e acessórios",null,null,null,"28.6","28..6","3-00","-3-00","28..6-3-00","28..6-3-00"]
[null,null,null,"28.63-1","","Fabricação de máquinas e equipamentos para a indústria têxtil",null,null,null,"",".","","--",".--",""]
[null,null,null,null,"28.63-1-00","Fabricação de máquinas e equipamentos para a indústria têxtil, peças e acessórios",null,null,null,"28.6","28..6","1-00","-1-00","28..6-1-00","28..6-1-00"]
[null,null,null,"28.64-0","","Fabricação de máquinas e equipamentos para as indústrias do vestuário, do couro e de calçados",null,null,null,"",".","","--",".--",""]
[null,null,null,null,"28.64-0-00","Fabricação de máquinas e equipamentos para as indústrias do vestuário, do couro e de calçados, peças e acessórios",null,null,null,"28.6","28..6","0-00","-0-00","28..6-0-00","28..6-0-00"]
[null,null,null,"28.65-8","","Fabricação de máquinas e equipamentos para as indústrias de celulose, papel e papelão e artefatos",null,null,null,"",".","","--",".--",""]
[null,null,null,null,"28.65-8-00","Fabricação de máquinas e equipamentos para as indústrias de celulose, papel e papelão e artefatos, peças e acessórios",null,null,null,"28.6","28..6","8-00","-8-00","28..6-8-00","28..6-8-00"]
[null,null,null,"28.66-6","","Fabricação de máquinas e equipamentos para a indústria do plástico",null,null,null,"",".","","--",".--",""]
[null,null,null,null,"28.66-6-00","Fabricação de máquinas e equipamentos para a indústria do plástico, peças e acessórios",null,null,null,"28.6","28..6","6-00","-6-00","28..6-6-00","28..6-6-00"]
[null,null,null,"28.69-1","","Fabricação de máquinas e equipamentos para uso industrial específico não especificados anteriormente",null,null,null,"",".","","--",".--",""]
[null,null,null,null,"28.69-1-00","Fabricação de máquinas e equipamentos para uso industrial específico não especificados anteriormente, peças e acessórios",null,null,null,"28.6","28..6","1-00","-1-00","28..6-1-00","28..6-1-00"]
[null,"29",null,null,"","FABRICAÇÃO DE VEÍCULOS AUTOMOTORES, REBOQUES E CARROCERIAS",null,null,null,"",".","","--",".--",""]
[null,null,"29.1",null,"","Fabricação de automóveis, camionetas e utilitários",null,null,null,"",".","","--",".--",""]
[null,null,null,"29.10-7","","Fabricação de automóveis, camionetas e utilitários",null,null,null,"",".","","--",".--",""]
[null,null,null,null,"29.10-7-01","Fabricação de automóveis, camionetas e utilitários",null,null,null,"29.1","29..1","7-01","-7-01","29..1-7-01","29..1-7-01"]
[null,null,null,null,"29.10-7-02","Fabricação de chassis com motor para automóveis, camionetas e utilitários",null,null,null,"29.1","29..1","7-02","-7-02","29..1-7-02","29..1-7-02"]
[null,null,null,null,"29.10-7-03","Fabricação de motores para automóveis, camionetas e utilitários",null,null,null,"29.1","29..1","7-03","-7-03","29..1-7-03","29..1-7-03"]
[null,null,"29.2",null,"","Fabricação de caminhões e ônibus",null,null,null,"",".","","--",".--",""]
[null,null,null,"29.20-4","","Fabricação de caminhões e ônibus",null,null,null,"",".","","--",".--",""]
[null,null,null,null,"29.20-4-01","Fabricação de caminhões e ônibus",null,null,null,"29.2","29..2","4-01","-4-01","29..2-4-01","29..2-4-01"]
[null,null,null,null,"29.20-4-02","Fabricação de motores para caminhões e ônibus",null,null,null,"29.2","29..2","4-02","-4-02","29..2-4-02","29..2-4-02"]
[null,null,"29.3",null,"","Fabricação de cabines, carrocerias e reboques para veículos automotores",null,null,null,"",".","","--",".--",""]
[null,null,null,"29.30-1","","Fabricação de cabines, carrocerias e reboques para veículos automotores",null,null,null,{"$f":"LEFT(E903,4)","v":""},{"$f":"CONCATENATE(LEFT(J903,2),\".\",RIGHT(J903,2))","v":"."},{"$f":"RIGHT(E903,4)","v":""},{"$f":"CONCATENATE(\"-\",LEFT(L903,1),\"-\",RIGHT(L903,2))","v":"--"},{"$f":"CONCATENATE(K903,M903)","v":".--"},""]
[null,null,null,null,"29.30-1-01","Fabricação de cabines, carrocerias e reboques para caminhões",null,null,null,"29.3","29..3","1-01","-1-01","29..3-1-01","29..3-1-01"]
[null,null,null,null,"29.30-1-02","Fabricação de carrocerias para ônibus",null,null,null,"29.3","29..3","1-02","-1-02","29..3-1-02","29..3-1-02"]
[null,null,null,null,"29.30-1-03","Fabricação de cabines, carrocerias e reboques para outros veículos automotores, exceto caminhões e ônibus",null,null,null,"29.3","29..3","1-03","-1-03","29..3-1-03","29..3-1-03"]
[null,null,"29.4",null,"","Fabricação de peças e acessórios para veículos automotores",null,null,null,"",".","","--",".--",{"$f":"IF(LEN(N907)=10,N907,\"\")","v":""}]
[null,null,null,"29.41-7","","Fabricação de peças e acessórios para o sistema motor de veículos automotores",null,null,null,"",".","","--",".--",""]
[null,null,null,null,"29.41-7-00","Fabricação de peças e acessórios para o sistema motor de veículos automotores",null,null,null,"29.4","29..4","7-00","-7-00","29..4-7-00","29..4-7-00"]
[null,null,null,"29.42-5","","Fabricação de peças e acessórios para os sistemas de marcha e transmissão de veículos automotores",null,null,null,"",".","","--",".--",""]
[null,null,null,null,"29.42-5-00","Fabricação de peças e acessórios para os sistemas de marcha e transmissão de veículos automotores",null,null,null,"29.4","29..4","5-00","-5-00","29..4-5-00","29..4-5-00"]
[null,null,null,"29.43-3","","Fabricação de peças e acessórios para o sistema de freios de veículos automotores",null,null,null,"",".","","--",".--",""]
[null,null,null,null,"29.43-3-00","Fabricação de peças e acessórios para o sistema de freios de veículos automotores",null,null,null,"29.4","29..4","3-00","-3-00","29..4-3-00","29..4-3-00"]
[null,null,null,"29.44-1","","Fabricação de peças e acessórios para o sistema de direção e suspensão de veículos automotores",null,null,null,"",".","","--",".--",""]
[null,null,null,null,"29.44-1-00","Fabricação de peças e acessórios para o sistema de direção e suspensão de veículos automotores",null,null,null,"29.4","29..4","1-00","-1-00","29..4-1-00","29..4-1-00"]
[null,null,null,"29.45-0","","Fabricação de material elétrico e eletrônico para veículos automotores, exceto baterias",null,null,null,"",".","","--",".--",""]
[null,null,null,null,"29.45-0-00","Fabricação de material elétrico e eletrônico para veículos automotores, exceto baterias",null,null,null,"29.4","29..4","0-00","-0-00","29..4-0-00","29..4-0-00"]
[null,null,null,"29.49-2","","Fabricação de peças e acessórios para veículos automotores não especificados anteriormente",null,null,null,"",".","","--",".--",""]
[null,null,null,null,"29.49-2-01","Fabricação de bancos e estofados para veículos automotores",null,null,null,"29.4","29..4","2-01","-2-01","29..4-2-01","29..4-2-01"]
[null,null,null,null,"29.49-2-99","Fabricação de outras peças e acessórios para veículos automotores não especificadas anteriormente",null,null,null,"29.4","29..4","2-99","-2-99","29..4-2-99","29..4-2-99"]
[null,null,"29.5",null,"","Recondicionamento e recuperação de motores para veículos automotores",null,null,null,"",".","","--",".--",""]
[null,null,null,"29.50-6","","Recondicionamento e recuperação de motores para veículos automotores",null,null,null,"",".","","--",".--",""]
[null,null,null,null,"29.50-6-00","Recondicionamento e recuperação de motores para veículos automotores",null,null,null,"29.5","29..5","6-00","-6-00","29..5-6-00","29..5-6-00"]
[null,"30",null,null,"","FABRICAÇÃO DE OUTROS EQUIPAMENTOS DE TRANSPORTE, EXCETO VEÍCULOS AUTOMOTORES",null,null,null,"",".","","--",".--",""]
[null,null,"30.1",null,"","Construção de embarcações",null,null,null,"",".","","--",".--",""]
[null,null,null,"30.11-3","","Construção de embarcações e estruturas flutuantes",null,null,null,"",".","","--",".--",""]
[null,null,null,null,"30.11-3-01","Construção de embarcações de grande porte",null,null,null,"30.1","30..1","3-01","-3-01","30..1-3-01","30..1-3-01"]
[null,null,null,null,"30.11-3-02","Construção de embarcações para uso comercial e para usos especiais, exceto de grande porte",null,null,null,"30.1","30..1","3-02","-3-02","30..1-3-02","30..1-3-02"]
[null,null,null,"30.12-1","","Construção de embarcações para esporte e lazer",null,null,null,"",".","","--",".--",""]
[null,null,null,null,"30.12-1-00","Construção de embarcações para esporte e lazer",null,null,null,"30.1","30..1","1-00","-1-00","30..1-1-00","30..1-1-00"]
[null,null,"30.3",null,"","Fabricação de veículos ferroviários",null,null,null,"",".","","--",".--",""]
[null,null,null,"30.31-8","","Fabricação de locomotivas, vagões e outros materiais rodantes",null,null,null,"",".","","--",".--",""]
[null,null,null,null,"30.31-8-00","Fabricação de locomotivas, vagões e outros materiais rodantes",null,null,null,"30.3","30..3","8-00","-8-00","30..3-8-00","30..3-8-00"]
[null,null,null,"30.32-6","","Fabricação de peças e acessórios para veículos ferroviários",null,null,null,"",".","","--",".--",""]
[null,null,null,null,"30.32-6-00","Fabricação de peças e acessórios para veículos ferroviários",null,null,null,"30.3","30..3","6-00","-6-00","30..3-6-00","30..3-6-00"]
[null,null,"30.4",null,"","Fabricação de aeronaves",null,null,null,"",".","","--",".--",""]
[null,null,null,"30.41-5","","Fabricação de aeronaves",null,null,null,"",".","","--",".--",""]
[null,null,null,null,"30.41-5-00","Fabricação de aeronaves",null,null,null,"30.4","30..4","5-00","-5-00","30..4-5-00","30..4-5-00"]
[null,null,null,"30.42-3","","Fabricação de turbinas, motores e outros componentes e peças para aeronaves",null,null,null,"",".","","--",".--",""]
[null,null,null,null,"30.42-3-00","Fabricação de turbinas, motores e outros componentes e peças para aeronaves",null,null,null,"30.4","30..4","3-00","-3-00","30..4-3-00","30..4-3-00"]
[null,null,"30.5",null,"","Fabricação de veículos militares de combate",null,null,null,"",".","","--",".--",""]
[null,null,null,"30.50-4","","Fabricação de veículos militares de combate",null,null,null,"",".","","--",".--",""]
[null,null,null,null,"30.50-4-00","Fabricação de veículos militares de combate",null,null,null,"30.5","30..5","4-00","-4-00","30..5-4-00","30..5-4-00"]
[null,null,"30.9",null,"","Fabricação de equipamentos de transporte não especificados anteriormente",null,null,null,"",".","","--",".--",""]
[null,null,null,"30.91-1","","Fabricação de motocicletas",null,null,null,"",".","","--",".--",""]
[null,null,null,null,"30.91-1-01","Fabricação de motocicletas",null,null,null,"30.9","30..9","1-01","-1-01","30..9-1-01","30..9-1-01"]
[null,null,null,null,"30.91-1-02","Fabricação de peças e acessórios para motocicletas",null,null,null,"30.9","30..9","1-02","-1-02","30..9-1-02","30..9-1-02"]
[null,null,null,"30.92-0","","Fabricação de bicicletas e triciclos não motorizados",null,null,null,"",".","","--",".--",""]
[null,null,null,null,"30.92-0-00","Fabricação de bicicletas e triciclos não motorizados, peças e acessórios",null,null,null,"30.9","30..9","0-00","-0-00","30..9-0-00","30..9-0-00"]
[null,null,null,"30.99-7","","Fabricação de equipamentos de transporte não especificados anteriormente",null,null,null,"",".","","--",".--",""]
[null,null,null,null,"30.99-7-00","Fabricação de equipamentos de transporte não especificados anteriormente",null,null,null,"30.9","30..9","7-00","-7-00","30..9-7-00","30..9-7-00"]
[null,"31",null,null,"","FABRICAÇÃO DE MÓVEIS",null,null,null,"",".","","--",".--",""]
[null,null,"31.0",null,"","Fabricação de móveis",null,null,null,"",".","","--",".--",""]
[null,null,null,"31.01-2","","Fabricação de móveis com predominância de madeira",null,null,null,"",".","","--",".--",""]
[null,null,null,null,"31.01-2-00","Fabricação de móveis com predominância de madeira","SIM",null,null,"31.0","31..0","2-00","-2-00","31..0-2-00","31..0-2-00"]
[null,null,null,"31.02-1","","Fabricação de móveis com predominância de metal",null,null,null,"",".","","--",".--",""]
[null,null,null,null,"31.02-1-00","Fabricação de móveis com predominância de metal","SIM",null,null,"31.0","31..0","1-00","-1-00","31..0-1-00","31..0-1-00"]
[null,null,null,"31.03-9","","Fabricação de móveis de outros materiais, exceto madeira e metal",null,null,null,"",".","","--",".--",""]
[null,null,null,null,"31.03-9-00","Fabricação de móveis de outros materiais, exceto madeira e metal","SIM",null,null,"31.0","31..0","9-00","-9-00","31..0-9-00","31..0-9-00"]
[null,null,null,"31.04-7","","Fabricação de colchões",null,null,null,"",".","","--",".--",""]
[null,null,null,null,"31.04-7-00","Fabricação de colchões",null,null,null,"31.0","31..0","7-00","-7-00","31..0-7-00","31..0-7-00"]
[null,"32",null,null,"","FABRICAÇÃO DE PRODUTOS DIVERSOS",null,null,null,"",".","","--",".--",""]
[null,null,"32.1",null,"","Fabricação de artigos de joalheria, bijuteria e semelhantes",null,null,null,"",".","","--",".--",""]
[null,null,null,"32.11-6","","Lapidação de gemas e fabricação de artefatos de ourivesaria e joalheria",null,null,null,"",".","","--",".--",""]
[null,null,null,null,"32.11-6-01","Lapidação de gemas",null,null,null,"32.1","32..1","6-01","-6-01","32..1-6-01","32..1-6-01"]
[null,null,null,null,"32.11-6-02","Fabricação de artefatos de joalheria e ourivesaria",null,null,null,"32.1","32..1","6-02","-6-02","32..1-6-02","32..1-6-02"]
[null,null,null,null,"32.11-6-03","Cunhagem de moedas e medalhas",null,null,null,{"$f":"LEFT(E967,4)","v":"32.1"},{"$f":"CONCATENATE(LEFT(J967,2),\".\",RIGHT(J967,2))","v":"32..1"},{"$f":"RIGHT(E967,4)","v":"6-03"},{"$f":"CONCATENATE(\"-\",LEFT(L967,1),\"-\",RIGHT(L967,2))","v":"-6-03"},{"$f":"CONCATENATE(K967,M967)","v":"32..1-6-03"},"32..1-6-03"]
[null,null,null,"32.12-4","","Fabricação de bijuterias e artefatos semelhantes",null,null,null,"",".","","--",".--",""]
[null,null,null,null,"32.12-4-00","Fabricação de bijuterias e artefatos semelhantes",null,null,null,"32.1","32..1","4-00","-4-00","32..1-4-00","32..1-4-00"]
[null,null,"32.2",null,"","Fabricação de instrumentos musicais",null,null,null,"",".","","--",".--",""]
[null,null,null,"32.20-5","","Fabricação de instrumentos musicais",null,null,null,"",".","","--",".--",{"$f":"IF(LEN(N971)=10,N971,\"\")","v":""}]
[null,null,null,null,"32.20-5-00","Fabricação de instrumentos musicais, peças e acessórios",null,null,null,"32.2","32..2","5-00","-5-00","32..2-5-00","32..2-5-00"]
[null,null,"32.3",null,"","Fabricação de artefatos para pesca e esporte",null,null,null,"",".","","--",".--",""]
[null,null,null,"32.30-2","","Fabricação de artefatos para pesca e esporte",null,null,null,"",".","","--",".--",""]
[null,null,null,null,"32.30-2-00","Fabricação de artefatos para pesca e esporte",null,null,null,"32.3","32..3","2-00","-2-00","32..3-2-00","32..3-2-00"]
[null,null,"32.4",null,"","Fabricação de brinquedos e jogos recreativos",null,null,null,"",".","","--",".--",""]
[null,null,null,"32.40-0","","Fabricação de brinquedos e jogos recreativos",null,null,null,"",".","","--",".--",""]
[null,null,null,null,"32.40-0-01","Fabricação de jogos eletrônicos",null,null,null,"32.4","32..4","0-01","-0-01","32..4-0-01","32..4-0-01"]
[null,null,null,null,"32.40-0-02","Fabricação de mesas de bilhar, de sinuca e acessórios não associada à locação",null,null,null,"32.4","32..4","0-02","-0-02","32..4-0-02","32..4-0-02"]
[null,null,null,null,"32.40-0-03","Fabricação de mesas de bilhar, de sinuca e acessórios associada à locação",null,null,null,"32.4","32..4","0-03","-0-03","32..4-0-03","32..4-0-03"]
[null,null,null,null,"32.40-0-99","Fabricação de outros brinquedos e jogos recreativos não especificados anteriormente",null,null,null,"32.4","32..4","0-99","-0-99","32..4-0-99","32..4-0-99"]
[null,null,"32.5",null,"","Fabricação de instrumentos e materiais para uso médico e odontológico e de artigos ópticos",null,null,null,"",".","","--",".--",""]
[null,null,null,"32.50-7","","Fabricação de instrumentos e materiais para uso médico e odontológico e de artigos ópticos",null,null,null,"",".","","--",".--",""]
[null,null,null,null,"32.50-7-01","Fabricação de instrumentos não eletrônicos e utensílios para uso médico, cirúrgico, odontológico e de laboratório",null,null,null,"32.5","32..5","7-01","-7-01","32..5-7-01","32..5-7-01"]
[null,null,null,null,"32.50-7-02","Fabricação de mobiliário para uso médico, cirúrgico, odontológico e de laboratório",null,null,null,"32.5","32..5","7-02","-7-02","32..5-7-02","32..5-7-02"]
[null,null,null,null,"32.50-7-03","Fabricação de aparelhos e utensílios para correção de defeitos físicos e aparelhos ortopédicos em geral sob encomenda",null,null,null,"32.5","32..5","7-03","-7-03","32..5-7-03","32..5-7-03"]
[null,null,null,null,"32.50-7-04","Fabricação de aparelhos e utensílios para correção de defeitos físicos e aparelhos ortopédicos em geral, exceto sob encomenda",null,null,null,"32.5","32..5","7-04","-7-04","32..5-7-04","32..5-7-04"]
[null,null,null,null,"32.50-7-05","Fabricação de materiais para medicina e odontologia",null,null,null,"32.5","32..5","7-05","-7-05","32..5-7-05","32..5-7-05"]
[null,null,null,null,"32.50-7-06","Serviços de prótese dentária",null,null,null,"32.5","32..5","7-06","-7-06","32..5-7-06","32..5-7-06"]
[null,null,null,null,"32.50-7-07","Fabricação de artigos ópticos",null,null,null,"32.5","32..5","7-07","-7-07","32..5-7-07","32..5-7-07"]
[null,null,null,null,"32.50-7-09","Serviço de laboratório óptico",null,null,null,"32.5","32..5","7-09","-7-09","32..5-7-09","32..5-7-09"]
[null,null,"32.9",null,"","Fabricação de produtos diversos",null,null,null,"",".","","--",".--",""]
[null,null,null,"32.91-4","","Fabricação de escovas, pincéis e vassouras",null,null,null,"",".","","--",".--",""]
[null,null,null,null,"32.91-4-00","Fabricação de escovas, pincéis e vassouras",null,null,null,"32.9","32..9","4-00","-4-00","32..9-4-00","32..9-4-00"]
[null,null,null,"32.92-2","","Fabricação de equipamentos e acessórios para segurança e proteção pessoal e profissional",null,null,null,"",".","","--",".--",""]
[null,null,null,null,"32.92-2-01","Fabricação de roupas de proteção e segurança e resistentes a fogo",null,null,null,"32.9","32..9","2-01","-2-01","32..9-2-01","32..9-2-01"]
[null,null,null,null,"32.92-2-02","Fabricação de equipamentos e acessórios para segurança pessoal e profissional",null,null,null,"32.9","32..9","2-02","-2-02","32..9-2-02","32..9-2-02"]
[null,null,null,"32.99-0","","Fabricação de produtos diversos não especificados anteriormente",null,null,null,"",".","","--",".--",""]
[null,null,null,null,"32.99-0-01","Fabricação de guarda-chuvas e similares",null,null,null,"32.9","32..9","0-01","-0-01","32..9-0-01","32..9-0-01"]
[null,null,null,null,"32.99-0-02","Fabricação de canetas, lápis e outros artigos para escritório",null,null,null,"32.9","32..9","0-02","-0-02","32..9-0-02","32..9-0-02"]
[null,null,null,null,"32.99-0-03","Fabricação de letras, letreiros e placas de qualquer material, exceto luminosos",null,null,null,"32.9","32..9","0-03","-0-03","32..9-0-03","32..9-0-03"]
[null,null,null,null,"32.99-0-04","Fabricação de painéis e letreiros luminosos",null,null,null,"32.9","32..9","0-04","-0-04","32..9-0-04","32..9-0-04"]
[null,null,null,null,"32.99-0-05","Fabricação de aviamentos para costura",null,null,null,"32.9","32..9","0-05","-0-05","32..9-0-05","32..9-0-05"]
[null,null,null,null,"32.99-0-06","Fabricação de velas, inclusive decorativas",null,null,null,"32.9","32..9","0-06","-0-06","32..9-0-06","32..9-0-06"]
[null,null,null,null,"32.99-0-99","Fabricação de produtos diversos não especificados anteriormente",null,null,null,"32.9","32..9","0-99","-0-99","32..9-0-99","32..9-0-99"]
[null,33,null,null,"","MANUTENÇÃO, REPARAÇÃO E INSTALAÇÃO DE MÁQUINAS E EQUIPAMENTOS",null,null,null,"",".","","--",".--",""]
[null,null,"33.1",null,"","Manutenção e reparação de máquinas e equipamentos",null,null,null,"",".","","--",".--",""]
[null,null,null,"33.11-2","","Manutenção e reparação de tanques, reservatórios metálicos e caldeiras, exceto para veículos",null,null,null,"",".","","--",".--",""]
[null,null,null,null,"33.11-2-00","Manutenção e reparação de tanques, reservatórios metálicos e caldeiras, exceto para veículos",null,null,null,"33.1","33..1","2-00","-2-00","33..1-2-00","33..1-2-00"]
[null,null,null,"33.12-1","","Manutenção e reparação de equipamentos eletrônicos e ópticos",null,null,null,"",".","","--",".--",""]
[null,null,null,null,"33.12-1-02","Manutenção e reparação de aparelhos e instrumentos de medida, teste e controle",null,null,null,"33.1","33..1","1-02","-1-02","33..1-1-02","33..1-1-02"]
[null,null,null,null,"33.12-1-03","Manutenção e reparação de aparelhos eletromédicos e eletroterapêuticos e equipamentos de irradiação",null,null,null,"33.1","33..1","1-03","-1-03","33..1-1-03","33..1-1-03"]
[null,null,null,null,"33.12-1-04","Manutenção e reparação de equipamentos e instrumentos ópticos",null,null,null,"33.1","33..1","1-04","-1-04","33..1-1-04","33..1-1-04"]
[null,null,null,"33.13-9","","Manutenção e reparação de máquinas e equipamentos elétricos",null,null,null,"",".","","--",".--",""]
[null,null,null,null,"33.13-9-01","Manutenção e reparação de geradores, transformadores e motores elétricos",null,null,null,"33.1","33..1","9-01","-9-01","33..1-9-01","33..1-9-01"]
[null,null,null,null,"33.13-9-02","Manutenção e reparação de baterias e acumuladores elétricos, exceto para veículos",null,null,null,"33.1","33..1","9-02","-9-02","33..1-9-02","33..1-9-02"]
[null,null,null,null,"33.13-9-99","Manutenção e reparação de máquinas, aparelhos e materiais elétricos não especificados anteriormente",null,null,null,"33.1","33..1","9-99","-9-99","33..1-9-99","33..1-9-99"]
[null,null,null,"33.14-7","","Manutenção e reparação de máquinas e equipamentos da indústria mecânica",null,null,null,"",".","","--",".--",""]
[null,null,null,null,"33.14-7-01","Manutenção e reparação de máquinas motrizes não elétricas",null,null,null,"33.1","33..1","7-01","-7-01","33..1-7-01","33..1-7-01"]
[null,null,null,null,"33.14-7-02","Manutenção e reparação de equipamentos hidráulicos e pneumáticos, exceto válvulas",null,null,null,"33.1","33..1","7-02","-7-02","33..1-7-02","33..1-7-02"]
[null,null,null,null,"33.14-7-03","Manutenção e reparação de válvulas industriais",null,null,null,"33.1","33..1","7-03","-7-03","33..1-7-03","33..1-7-03"]
[null,null,null,null,"33.14-7-04","Manutenção e reparação de compressores",null,null,null,"33.1","33..1","7-04","-7-04","33..1-7-04","33..1-7-04"]
[null,null,null,null,"33.14-7-05","Manutenção e reparação de equipamentos de transmissão para fins industriais",null,null,null,"33.1","33..1","7-05","-7-05","33..1-7-05","33..1-7-05"]
[null,null,null,null,"33.14-7-06","Manutenção e reparação de máquinas, aparelhos e equipamentos para instalações térmicas",null,null,null,"33.1","33..1","7-06","-7-06","33..1-7-06","33..1-7-06"]
[null,null,null,null,"33.14-7-07","Manutenção e reparação de máquinas e aparelhos de refrigeração e ventilação para uso industrial e comercial",null,null,null,"33.1","33..1","7-07","-7-07","33..1-7-07","33..1-7-07"]
[null,null,null,null,"33.14-7-08","Manutenção e reparação de máquinas, equipamentos e aparelhos para transporte e elevação de cargas",null,null,null,"33.1","33..1","7-08","-7-08","33..1-7-08","33..1-7-08"]
[null,null,null,null,"33.14-7-09","Manutenção e reparação de máquinas de escrever, calcular e de outros equipamentos não eletrônicos para escritório",null,null,null,"33.1","33..1","7-09","-7-09","33..1-7-09","33..1-7-09"]
[null,null,null,null,"33.14-7-10","Manutenção e reparação de máquinas e equipamentos para uso geral não especificados anteriormente",null,null,null,"33.1","33..1","7-10","-7-10","33..1-7-10","33..1-7-10"]
[null,null,null,null,"33.14-7-11","Manutenção e reparação de máquinas e equipamentos para agricultura e pecuária",null,null,null,"33.1","33..1","7-11","-7-11","33..1-7-11","33..1-7-11"]
[null,null,null,null,"33.14-7-12","Manutenção e reparação de tratores agrícolas",null,null,null,"33.1","33..1","7-12","-7-12","33..1-7-12","33..1-7-12"]
[null,null,null,null,"33.14-7-13","Manutenção e reparação de máquinas-ferramenta",null,null,null,{"$f":"LEFT(E1031,4)","v":"33.1"},{"$f":"CONCATENATE(LEFT(J1031,2),\".\",RIGHT(J1031,2))","v":"33..1"},{"$f":"RIGHT(E1031,4)","v":"7-13"},{"$f":"CONCATENATE(\"-\",LEFT(L1031,1),\"-\",RIGHT(L1031,2))","v":"-7-13"},{"$f":"CONCATENATE(K1031,M1031)","v":"33..1-7-13"},"33..1-7-13"]
[null,null,null,null,"33.14-7-14","Manutenção e reparação de máquinas e equipamentos para a prospecção e extração de petróleo",null,null,null,"33.1","33..1","7-14","-7-14","33..1-7-14","33..1-7-14"]
[null,null,null,null,"33.14-7-15","Manutenção e reparação de máquinas e equipamentos para uso na extração mineral, exceto na extração de petróleo",null,null,null,"33.1","33..1","7-15","-7-15","33..1-7-15","33..1-7-15"]
[null,null,null,null,"33.14-7-16","Manutenção e reparação de tratores, exceto agrícolas",null,null,null,"33.1","33..1","7-16","-7-16","33..1-7-16","33..1-7-16"]
[null,null,null,null,"33.14-7-17","Manutenção e reparação de máquinas e equipamentos de terraplenagem, pavimentação e construção, exceto tratores",null,null,null,"33.1","33..1","7-17","-7-17","33..1-7-17",{"$f":"IF(LEN(N1035)=10,N1035,\"\")","v":"33..1-7-17"}]
[null,null,null,null,"33.14-7-18","Manutenção e reparação de máquinas para a indústria metalúrgica, exceto máquinas-ferramenta",null,null,null,"33.1","33..1","7-18","-7-18","33..1-7-18","33..1-7-18"]
[null,null,null,null,"33.14-7-19","Manutenção e reparação de máquinas e equipamentos para as indústrias de alimentos, bebidas e fumo",null,null,null,"33.1","33..1","7-19","-7-19","33..1-7-19","33..1-7-19"]
[null,null,null,null,"33.14-7-20","Manutenção e reparação de máquinas e equipamentos para a indústria têxtil, do vestuário, do couro e calçados",null,null,null,"33.1","33..1","7-20","-7-20","33..1-7-20","33..1-7-20"]
[null,null,null,null,"33.14-7-21","Manutenção e reparação de máquinas e aparelhos para a indústria de celulose, papel e papelão e artefatos",null,null,null,"33.1","33..1","7-21","-7-21","33..1-7-21","33..1-7-21"]
[null,null,null,null,"33.14-7-22","Manutenção e reparação de máquinas e aparelhos para a indústria do plástico",null,null,null,"33.1","33..1","7-22","-7-22","33..1-7-22","33..1-7-22"]
[null,null,null,null,"33.14-7-99","Manutenção e reparação de outras máquinas e equipamentos para usos industriais não especificados anteriormente",null,null,null,"33.1","33..1","7-99","-7-99","33..1-7-99","33..1-7-99"]
[null,null,null,"33.15-5","","Manutenção e reparação de veículos ferroviários",null,null,null,"",".","","--",".--",""]
[null,null,null,null,"33.15-5-00","Manutenção e reparação de veículos ferroviários",null,null,null,"33.1","33..1","5-00","-5-00","33..1-5-00","33..1-5-00"]
[null,null,null,"33.16-3","","Manutenção e reparação de aeronaves",null,null,null,"",".","","--",".--",""]
[null,null,null,null,"33.16-3-01","Manutenção e reparação de aeronaves, exceto a manutenção na pista",null,null,null,"33.1","33..1","3-01","-3-01","33..1-3-01","33..1-3-01"]
[null,null,null,null,"33.16-3-02","Manutenção de aeronaves na pista",null,null,null,"33.1","33..1","3-02","-3-02","33..1-3-02","33..1-3-02"]
[null,null,null,"33.17-1","","Manutenção e reparação de embarcações",null,null,null,"",".","","--",".--",""]
[null,null,null,null,"33.17-1-01","Manutenção e reparação de embarcações e estruturas flutuantes",null,null,null,"33.1","33..1","1-01","-1-01","33..1-1-01","33..1-1-01"]
[null,null,null,null,"33.17-1-02","Manutenção e reparação de embarcações para esporte e lazer",null,null,null,"33.1","33..1","1-02","-1-02","33..1-1-02","33..1-1-02"]
[null,null,null,"33.19-8","","Manutenção e reparação de equipamentos e produtos não especificados anteriormente",null,null,null,"",".","","--",".--",""]
[null,null,null,null,"33.19-8-00","Manutenção e reparação de equipamentos e produtos não especificados anteriormente",null,null,null,"33.1","33..1","8-00","-8-00","33..1-8-00","33..1-8-00"]
[null,null,"33.2",null,"","Instalação de máquinas e equipamentos",null,null,null,"",".","","--",".--",""]
[null,null,null,"33.21-0","","Instalação de máquinas e equipamentos industriais",null,null,null,"",".","","--",".--",""]
[null,null,null,null,"33.21-0-00","Instalação de máquinas e equipamentos industriais",null,null,null,"33.2","33..2","0-00","-0-00","33..2-0-00","33..2-0-00"]
[null,null,null,"33.29-5","","Instalação de equipamentos não especificados anteriormente",null,null,null,"",".","","--",".--",""]
[null,null,null,null,"33.29-5-01","Serviços de montagem de móveis de qualquer material",null,null,null,"33.2","33..2","5-01","-5-01","33..2-5-01","33..2-5-01"]
[null,null,null,null,"33.29-5-99","Instalação de outros equipamentos não especificados anteriormente",null,null,null,"33.2","33..2","5-99","-5-99","33..2-5-99","33..2-5-99"]
["D",null,null,null,"","ELETRICIDADE E GÁS",null,null,null,"",".","","--",".--",""]
[null,35,null,null,"","ELETRICIDADE, GÁS E OUTRAS UTILIDADES",null,null,null,"",".","","--",".--",""]
[null,null,"35.1",null,"","Geração, transmissão e distribuição de energia elétrica",null,null,null,"",".","","--",".--",""]
[null,null,null,"35.11-5","","Geração de energia elétrica",null,null,null,"",".","","--",".--",""]
[null,null,null,null,"35.11-5-01","Geração de energia elétrica",null,null,null,"35.1","35..1","5-01","-5-01","35..1-5-01","35..1-5-01"]
[null,null,null,null,"35.11-5-02","Atividades de coordenação e controle da operação da geração e transmissão de energia elétrica",null,null,null,"35.1","35..1","5-02","-5-02","35..1-5-02","35..1-5-02"]
[null,null,null,"35.12-3","","Transmissão de energia elétrica",null,null,null,"",".","","--",".--",""]
[null,null,null,null,"35.12-3-00","Transmissão de energia elétrica",null,null,null,"35.1","35..1","3-00","-3-00","35..1-3-00","35..1-3-00"]
[null,null,null,"35.13-1","","Comércio atacadista de energia elétrica",null,null,null,"",".","","--",".--",""]
[null,null,null,null,"35.13-1-00","Comércio atacadista de energia elétrica",null,null,null,"35.1","35..1","1-00","-1-00","35..1-1-00","35..1-1-00"]
[null,null,null,"35.14-0","","Distribuição de energia elétrica",null,null,null,"",".","","--",".--",""]
[null,null,null,null,"35.14-0-00","Distribuição de energia elétrica",null,null,null,"35.1","35..1","0-00","-0-00","35..1-0-00","35..1-0-00"]
[null,null,"35.2",null,"","Produção e distribuição de combustíveis gasosos por redes urbanas",null,null,null,"",".","","--",".--",""]
[null,null,null,"35.20-4","","Produção de gás; processamento de gás natural; distribuição de combustíveis gasosos por redes urbanas",null,null,null,"",".","","--",".--",""]
[null,null,null,null,"35.20-4-01","Produção de gás; processamento de gás natural",null,null,null,"35.2","35..2","4-01","-4-01","35..2-4-01","35..2-4-01"]
[null,null,null,null,"35.20-4-02","Distribuição de combustíveis gasosos por redes urbanas",null,null,null,"35.2","35..2","4-02","-4-02","35..2-4-02","35..2-4-02"]
[null,null,"35.3",null,"","Produção e distribuição de vapor, água quente e ar\ncondicionado",null,null,null,"",".","","--",".--",""]
[null,null,null,"35.30-1","","Produção e distribuição de vapor, água quente e ar\ncondicionado",null,null,null,"",".","","--",".--",""]
[null,null,null,null,"35.30-1-00","Produção e distribuição de vapor, água quente e ar condicionado",null,null,null,"35.3","35..3","1-00","-1-00","35..3-1-00","35..3-1-00"]
["E",null,null,null,"","ÁGUA, ESGOTO, ATIVIDADES DE GESTÃO DE RESÍDUOS E DESCONTAMINAÇÃO",null,null,null,"",".","","--",".--",""]
[null,36,null,null,"","CAPTAÇÃO, TRATAMENTO E DISTRIBUIÇÃO DE ÁGUA",null,null,null,"",".","","--",".--",""]
[null,null,"36.0",null,"","Captação, tratamento e distribuição de água",null,null,null,"",".","","--",".--",""]
[null,null,null,"36.00-6","","Captação, tratamento e distribuição de água",null,null,null,"",".","","--",".--",""]
[null,null,null,null,"36.00-6-01","Captação, tratamento e distribuição de água",null,null,null,"36.0","36..0","6-01","-6-01","36..0-6-01","36..0-6-01"]
[null,null,null,null,"36.00-6-02","Distribuição de água por caminhões",null,null,null,"36.0","36..0","6-02","-6-02","36..0-6-02","36..0-6-02"]
[null,37,null,null,"","ESGOTO E ATIVIDADES RELACIONADAS",null,null,null,"",".","","--",".--",""]
[null,null,"37.0",null,"","Esgoto e atividades relacionadas",null,null,null,"",".","","--",".--",""]
[null,null,null,"37.01-1","","Gestão de redes de esgoto",null,null,null,"",".","","--",".--",""]
[null,null,null,null,"37.01-1-00","Gestão de redes de esgoto",null,null,null,"37.0","37..0","1-00","-1-00","37..0-1-00","37..0-1-00"]
[null,null,null,"37.02-9","","Atividades relacionadas a esgoto, exceto a gestão de redes",null,null,null,"",".","","--",".--",""]
[null,null,null,null,"37.02-9-00","Atividades relacionadas a esgoto, exceto a gestão de redes",null,null,null,"37.0","37..0","9-00","-9-00","37..0-9-00","37..0-9-00"]
[null,38,null,null,"","COLETA, TRATAMENTO E DISPOSIÇÃO DE RESÍDUOS; RECUPERAÇÃO DE MATERIAIS",null,null,null,"",".","","--",".--",""]
[null,null,"38.1",null,"","Coleta de resíduos",null,null,null,"",".","","--",".--",""]
[null,null,null,"38.11-4","","Coleta de resíduos não perigosos",null,null,null,"",".","","--",".--",""]
[null,null,null,null,"38.11-4-00","Coleta de resíduos não perigosos",null,null,null,"38.1","38..1","4-00","-4-00","38..1-4-00","38..1-4-00"]
[null,null,null,"38.12-2","","Coleta de resíduos perigosos",null,null,null,"",".","","--",".--",""]
[null,null,null,null,"38.12-2-00","Coleta de resíduos perigosos",null,null,null,"38.1","38..1","2-00","-2-00","38..1-2-00","38..1-2-00"]
[null,null,"38.2",null,"","Tratamento e disposição de resíduos",null,null,null,{"$f":"LEFT(E1095,4)","v":""},{"$f":"CONCATENATE(LEFT(J1095,2),\".\",RIGHT(J1095,2))","v":"."},{"$f":"RIGHT(E1095,4)","v":""},{"$f":"CONCATENATE(\"-\",LEFT(L1095,1),\"-\",RIGHT(L1095,2))","v":"--"},{"$f":"CONCATENATE(K1095,M1095)","v":".--"},""]
[null,null,null,"38.21-1","","Tratamento e disposição de resíduos não perigosos",null,null,null,"",".","","--",".--",""]
[null,null,null,null,"38.21-1-00","Tratamento e disposição de resíduos não perigosos",null,null,null,"38.2","38..2","1-00","-1-00","38..2-1-00","38..2-1-00"]
[null,null,null,"38.22-0","","Tratamento e disposição de resíduos perigosos",null,null,null,"",".","","--",".--",""]
[null,null,null,null,"38.22-0-00","Tratamento e disposição de resíduos perigosos",null,null,null,"38.2","38..2","0-00","-0-00","38..2-0-00",{"$f":"IF(LEN(N1099)=10,N1099,\"\")","v":"38..2-0-00"}]
[null,null,"38.3",null,"","Recuperação de materiais",null,null,null,"",".","","--",".--",""]
[null,null,null,"38.31-9","","Recuperação de materiais metálicos",null,null,null,"",".","","--",".--",""]
[null,null,null,null,"38.31-9-01","Recuperação de sucatas de alumínio",null,null,null,"38.3","38..3","9-01","-9-01","38..3-9-01","38..3-9-01"]
[null,null,null,null,"38.31-9-99","Recuperação de materiais metálicos, exceto alumínio",null,null,null,"38.3","38..3","9-99","-9-99","38..3-9-99","38..3-9-99"]
[null,null,null,"38.32-7","","Recuperação de materiais plásticos",null,null,null,"",".","","--",".--",""]
[null,null,null,null,"38.32-7-00","Recuperação de materiais plásticos",null,null,null,"38.3","38..3","7-00","-7-00","38..3-7-00","38..3-7-00"]
[null,null,null,"38.39-4","","Recuperação de materiais não especificados anteriormente",null,null,null,"",".","","--",".--",""]
[null,null,null,null,"38.39-4-01","Usinas de compostagem",null,null,null,"38.3","38..3","4-01","-4-01","38..3-4-01","38..3-4-01"]
[null,null,null,null,"38.39-4-99","Recuperação de materiais não especificados anteriormente",null,null,null,"38.3","38..3","4-99","-4-99","38..3-4-99","38..3-4-99"]
[null,39,null,null,"","DESCONTAMINAÇÃO E OUTROS SERVIÇOS DE GESTÃO DE RESÍDUOS",null,null,null,"",".","","--",".--",""]
[null,null,"39.0",null,"","Descontaminação e outros serviços de gestão de resíduos",null,null,null,"",".","","--",".--",""]
[null,null,null,"39.00-5","","Descontaminação e outros serviços de gestão de resíduos",null,null,null,"",".","","--",".--",""]
[null,null,null,null,"39.00-5-00","Descontaminação e outros serviços de gestão de resíduos",null,null,null,"39.0","39..0","5-00","-5-00","39..0-5-00","39..0-5-00"]
["F",null,null,null,"","CONSTRUÇÃO",null,null,null,"",".","","--",".--",""]
[null,41,null,null,"","CONSTRUÇÃO DE EDIFÍCIOS",null,null,null,"",".","","--",".--",""]
[null,null,"41.1",null,"","Incorporação de empreendimentos imobiliários",null,null,null,"",".","","--",".--",""]
[null,null,null,"41.10-7","","Incorporação de empreendimentos imobiliários",null,null,null,"",".","","--",".--",""]
[null,null,null,null,"41.10-7-00","Incorporação de empreendimentos imobiliários","SIM",null,null,"41.1","41..1","7-00","-7-00","41..1-7-00","41..1-7-00"]
[null,null,"41.2",null,"","Construção de edifícios",null,null,null,"",".","","--",".--",""]
[null,null,null,"41.20-4","","Construção de edifícios",null,null,null,"",".","","--",".--",""]
[null,null,null,null,"41.20-4-00","Construção de edifícios","SIM",null,null,"41.2","41..2","4-00","-4-00","41..2-4-00","41..2-4-00"]
[null,42,null,null,"","OBRAS DE INFRAESTRUTURA",null,null,null,"",".","","--",".--",""]
[null,null,"42.1",null,"","Construção de rodovias, ferrovias, obras urbanas e obras-de-arte especiais",null,null,null,"",".","","--",".--",""]
[null,null,null,"42.11-1","","Construção de rodovias e ferrovias","SIM",null,null,"",".","","--",".--",""]
[null,null,null,null,"42.11-1-01","Construção de rodovias e ferrovias","SIM",null,null,"42.1","42..1","1-01","-1-01","42..1-1-01","42..1-1-01"]
[null,null,null,null,"42.11-1-02","Pintura para sinalização em pistas rodoviárias e aeroportos",null,null,null,"42.1","42..1","1-02","-1-02","42..1-1-02","42..1-1-02"]
[null,null,null,"42.12-0","","Construção de obras de arte especiais",null,null,null,"",".","","--",".--",""]
[null,null,null,null,"42.12-0-00","Construção de obras de arte especiais","SIM",null,null,"42.1","42..1","0-00","-0-00","42..1-0-00","42..1-0-00"]
[null,null,null,"42.13-8","","Obras de urbanização - ruas, praças e calçadas",null,null,null,"",".","","--",".--",""]
[null,null,null,null,"42.13-8-00","Obras de urbanização - ruas, praças e calçadas","SIM",null,null,"42.1","42..1","8-00","-8-00","42..1-8-00","42..1-8-00"]
[null,null,"42.2",null,"","Obras de infraestrutura para energia elétrica, telecomunicações, água, esgoto e transporte por dutos",null,null,null,"",".","","--",".--",""]
[null,null,null,"42.21-9","","Obras para geração e distribuição de energia elétrica e para telecomunicações",null,null,null,"",".","","--",".--",""]
[null,null,null,null,"42.21-9-01","Construção de barragens e represas para geração de energia \nelétrica","SIM",null,null,"42.2","42..2","9-01","-9-01","42..2-9-01","42..2-9-01"]
[null,null,null,null,"42.21-9-02","Construção de estações e redes de distribuição de energia elétrica","SIM",null,null,"42.2","42..2","9-02","-9-02","42..2-9-02","42..2-9-02"]
[null,null,null,null,"42.21-9-03","Manutenção de redes de distribuição de energia elétrica","SIM",null,null,"42.2","42..2","9-03","-9-03","42..2-9-03","42..2-9-03"]
[null,null,null,null,"42.21-9-04","Construção de estações e redes de telecomunicações","SIM",null,null,"42.2","42..2","9-04","-9-04","42..2-9-04","42..2-9-04"]
[null,null,null,null,"42.21-9-05","Manutenção de estações e redes de telecomunicações","SIM",null,null,"42.2","42..2","9-05","-9-05","42..2-9-05","42..2-9-05"]
[null,null,null,"42.22-7","","Construção de redes de abastecimento de água, coleta de esgoto e construções correlatas",null,null,null,"",".","","--",".--",""]
[null,null,null,null,"42.22-7-01","Construção de redes de abastecimento de água, coleta de esgoto e construções correlatas, exceto obras de irrigação","SIM",null,null,"42.2","42..2","7-01","-7-01","42..2-7-01","42..2-7-01"]
[null,null,null,null,"42.22-7-02","Obras de irrigação","SIM",null,null,"42.2","42..2","7-02","-7-02","42..2-7-02","42..2-7-02"]
[null,null,null,"42.23-5","","Construção de redes de transportes por dutos, exceto para água e esgoto",null,null,null,"",".","","--",".--",""]
[null,null,null,null,"42.23-5-00","Construção de redes de transportes por dutos, exceto para água e esgoto","SIM",null,null,"42.2","42..2","5-00","-5-00","42..2-5-00","42..2-5-00"]
[null,null,"42.9",null,"","Construção de outras obras de infraestrutura",null,null,null,"",".","","--",".--",""]
[null,null,null,"42.91-0","","Obras portuárias, marítimas e fluviais",null,null,null,"",".","","--",".--",""]
[null,null,null,null,"42.91-0-00","Obras portuárias, marítimas e fluviais","SIM",null,null,"42.9","42..9","0-00","-0-00","42..9-0-00","42..9-0-00"]
[null,null,null,"42.92-8","","Montagem de instalações industriais e de estruturas metálicas",null,null,null,"",".","","--",".--",""]
[null,null,null,null,"42.92-8-01","Montagem de estruturas metálicas","SIM",null,null,"42.9","42..9","8-01","-8-01","42..9-8-01","42..9-8-01"]
[null,null,null,null,"42.92-8-02","Obras de montagem industrial","SIM",null,null,"42.9","42..9","8-02","-8-02","42..9-8-02","42..9-8-02"]
[null,null,null,"42.99-5","","Obras de engenharia civil não especificadas anteriormente",null,null,null,"",".","","--",".--",""]
[null,null,null,null,"42.99-5-01","Construção de instalações esportivas e recreativas","SIM",null,null,"42.9","42..9","5-01","-5-01","42..9-5-01","42..9-5-01"]
[null,null,null,null,"42.99-5-99","Outras obras de engenharia civil não especificadas anteriormente","SIM",null,null,"42.9","42..9","5-99","-5-99","42..9-5-99","42..9-5-99"]
[null,43,null,null,"","SERVIÇOS ESPECIALIZADOS PARA CONSTRUÇÃO",null,null,null,"",".","","--",".--",""]
[null,null,"43.1",null,"","Demolição e preparação do terreno",null,null,null,"",".","","--",".--",""]
[null,null,null,"43.11-8","","Demolição e preparação de canteiros de obras",null,null,null,"",".","","--",".--",""]
[null,null,null,null,"43.11-8-01","Demolição de edifícios e outras estruturas","SIM",null,null,"43.1","43..1","8-01","-8-01","43..1-8-01","43..1-8-01"]
[null,null,null,null,"43.11-8-02","Preparação de canteiro e limpeza de terreno","SIM",null,null,"43.1","43..1","8-02","-8-02","43..1-8-02","43..1-8-02"]
[null,null,null,"43.12-6","","Perfurações e sondagens",null,null,null,"",".","","--",".--",""]
[null,null,null,null,"43.12-6-00","Perfurações e sondagens","SIM",null,null,"43.1","43..1","6-00","-6-00","43..1-6-00","43..1-6-00"]
[null,null,null,"43.13-4","","Obras de terraplenagem",null,null,null,"",".","","--",".--",""]
[null,null,null,null,"43.13-4-00","Obras de terraplenagem","SIM",null,null,{"$f":"LEFT(E1159,4)","v":"43.1"},{"$f":"CONCATENATE(LEFT(J1159,2),\".\",RIGHT(J1159,2))","v":"43..1"},{"$f":"RIGHT(E1159,4)","v":"4-00"},{"$f":"CONCATENATE(\"-\",LEFT(L1159,1),\"-\",RIGHT(L1159,2))","v":"-4-00"},{"$f":"CONCATENATE(K1159,M1159)","v":"43..1-4-00"},"43..1-4-00"]
[null,null,null,"43.19-3","","Serviços de preparação do terreno não especificados anteriormente",null,null,null,"",".","","--",".--",""]
[null,null,null,null,"43.19-3-00","Serviços de preparação do terreno não especificados anteriormente","SIM",null,null,"43.1","43..1","3-00","-3-00","43..1-3-00","43..1-3-00"]
[null,null,"43.2",null,"","Instalações elétricas, hidráulicas e outras instalações em construções",null,null,null,"",".","","--",".--",""]
[null,null,null,"43.21-5","","Instalações elétricas",null,null,null,"",".","","--",".--",{"$f":"IF(LEN(N1163)=10,N1163,\"\")","v":""}]
[null,null,null,null,"43.21-5-00","Instalação e manutenção elétrica","SIM",null,null,"43.2","43..2","5-00","-5-00","43..2-5-00","43..2-5-00"]
[null,null,null,"43.22-3","","Instalações hidráulicas, de sistemas de ventilação e\nrefrigeração",null,null,null,"",".","","--",".--",""]
[null,null,null,null,"43.22-3-01","Instalações hidráulicas, sanitárias e de gás","SIM",null,null,"43.2","43..2","3-01","-3-01","43..2-3-01","43..2-3-01"]
[null,null,null,null,"43.22-3-02","Instalação e manutenção de sistemas centrais de ar condicionado, de ventilação e refrigeração","SIM",null,null,"43.2","43..2","3-02","-3-02","43..2-3-02","43..2-3-02"]
[null,null,null,null,"43.22-3-03","Instalações de sistema de prevenção contra incêndio","SIM",null,null,"43.2","43..2","3-03","-3-03","43..2-3-03","43..2-3-03"]
[null,null,null,"43.29-1","","Obras de instalações em construções não especificadas anteriormente",null,null,null,"",".","","--",".--",""]
[null,null,null,null,"43.29-1-01","Instalação de painéis publicitários","SIM",null,null,"43.2","43..2","1-01","-1-01","43..2-1-01","43..2-1-01"]
[null,null,null,null,"43.29-1-02","Instalação de equipamentos para orientação à navegação marítima, fluvial e lacustre","SIM",null,null,"43.2","43..2","1-02","-1-02","43..2-1-02","43..2-1-02"]
[null,null,null,null,"43.29-1-03","Instalação, manutenção e reparação de elevadores, escadas e esteiras rolantes","SIM",null,null,"43.2","43..2","1-03","-1-03","43..2-1-03","43..2-1-03"]
[null,null,null,null,"43.29-1-04","Montagem e instalação de sistemas e equipamentos de iluminação e sinalização em vias públicas, portos e aeroportos","SIM",null,null,"43.2","43..2","1-04","-1-04","43..2-1-04","43..2-1-04"]
[null,null,null,null,"43.29-1-05","Tratamentos térmicos, acústicos ou de vibração","SIM",null,null,"43.2","43..2","1-05","-1-05","43..2-1-05","43..2-1-05"]
[null,null,null,null,"43.29-1-99","Outras obras de instalações em construções não especificadas anteriormente","SIM",null,null,"43.2","43..2","1-99","-1-99","43..2-1-99","43..2-1-99"]
[null,null,"43.3",null,"","Obras de acabamento",null,null,null,"",".","","--",".--",""]
[null,null,null,"43.30-4","","Obras de acabamento",null,null,null,"",".","","--",".--",""]
[null,null,null,null,"43.30-4-01","Impermeabilização em obras de engenharia civil","SIM",null,null,"43.3","43..3","4-01","-4-01","43..3-4-01","43..3-4-01"]
[null,null,null,null,"43.30-4-02","Instalação de portas, janelas, tetos, divisórias e armários embutidos de qualquer material","SIM",null,null,"43.3","43..3","4-02","-4-02","43..3-4-02","43..3-4-02"]
[null,null,null,null,"43.30-4-03","Obras de acabamento em gesso e estuque","SIM",null,null,"43.3","43..3","4-03","-4-03","43..3-4-03","43..3-4-03"]
[null,null,null,null,"43.30-4-04","Serviços de pintura de edifícios em geral","SIM",null,null,"43.3","43..3","4-04","-4-04","43..3-4-04","43..3-4-04"]
[null,null,null,null,"43.30-4-05","Aplicação de revestimentos e de resinas em interiores e exteriores","SIM",null,null,"43.3","43..3","4-05","-4-05","43..3-4-05","43..3-4-05"]
[null,null,null,null,"43.30-4-99","Outras obras de acabamento da construção","SIM",null,null,"43.3","43..3","4-99","-4-99","43..3-4-99","43..3-4-99"]
[null,null,"43.9",null,"","Outros serviços especializados para construção",null,null,null,"",".","","--",".--",""]
[null,null,null,"43.91-6","","Obras de fundações",null,null,null,"",".","","--",".--",""]
[null,null,null,null,"43.91-6-00","Obras de fundações","SIM",null,null,"43.9","43..9","6-00","-6-00","43..9-6-00","43..9-6-00"]
[null,null,null,"43.99-1","","Serviços especializados para construção não especificados anteriormente",null,null,null,"",".","","--",".--",""]
[null,null,null,null,"43.99-1-01","Administração de obras","SIM",null,null,"43.9","43..9","1-01","-1-01","43..9-1-01","43..9-1-01"]
[null,null,null,null,"43.99-1-02","Montagem e desmontagem de andaimes e outras estruturas temporárias","SIM",null,null,"43.9","43..9","1-02","-1-02","43..9-1-02","43..9-1-02"]
[null,null,null,null,"43.99-1-03","Obras de alvenaria","SIM",null,null,"43.9","43..9","1-03","-1-03","43..9-1-03","43..9-1-03"]
[null,null,null,null,"43.99-1-04","Serviços de operação e fornecimento de equipamentos para transporte e elevação de cargas e pessoas para uso em obras","SIM",null,null,"43.9","43..9","1-04","-1-04","43..9-1-04","43..9-1-04"]
[null,null,null,null,"43.99-1-05","Perfuração e construção de poços de água","SIM",null,null,"43.9","43..9","1-05","-1-05","43..9-1-05","43..9-1-05"]
[null,null,null,null,"43.99-1-99","Serviços especializados para construção não especificados anteriormente","SIM",null,null,"43.9","43..9","1-99","-1-99","43..9-1-99","43..9-1-99"]
["G",null,null,null,"","COMÉRCIO; REPARAÇÃO DE VEÍCULOS AUTOMOTORES E MOTOCICLETAS",null,null,null,"",".","","--",".--",""]
[null,45,null,null,"","COMÉRCIO E REPARAÇÃO DE VEÍCULOS AUTOMOTORES E MOTOCICLETAS",null,null,null,"",".","","--",".--",""]
[null,null,"45.1",null,"","Comércio de veículos automotores",null,null,null,"",".","","--",".--",""]
[null,null,null,"45.11-1","","Comércio a varejo e por atacado de veículos automotores",null,null,null,"",".","","--",".--",""]
[null,null,null,null,"45.11-1-01","Comércio a varejo de automóveis, camionetas e utilitários novos",null,null,null,"45.1","45..1","1-01","-1-01","45..1-1-01","45..1-1-01"]
[null,null,null,null,"45.11-1-02","Comércio a varejo de automóveis, camionetas e utilitários usados",null,null,null,"45.1","45..1","1-02","-1-02","45..1-1-02","45..1-1-02"]
[null,null,null,null,"45.11-1-03","Comércio por atacado de automóveis, camionetas e utilitários novos e usados",null,null,null,"45.1","45..1","1-03","-1-03","45..1-1-03","45..1-1-03"]
[null,null,null,null,"45.11-1-04","Comércio por atacado de caminhões novos e usados",null,null,null,"45.1","45..1","1-04","-1-04","45..1-1-04","45..1-1-04"]
[null,null,null,null,"45.11-1-05","Comércio por atacado de reboques e semireboques novos e usados",null,null,null,"45.1","45..1","1-05","-1-05","45..1-1-05","45..1-1-05"]
[null,null,null,null,"45.11-1-06","Comércio por atacado de ônibus e micro-ônibus novos e usados",null,null,null,"45.1","45..1","1-06","-1-06","45..1-1-06","45..1-1-06"]
[null,null,null,"45.12-9","","Representantes comerciais e agentes do comércio de veículos automotores",null,null,null,"",".","","--",".--",""]
[null,null,null,null,"45.12-9-01","Representantes comerciais e agentes do comércio de veículos automotores",null,null,null,"45.1","45..1","9-01","-9-01","45..1-9-01","45..1-9-01"]
[null,null,null,null,"45.12-9-02","Comércio sob consignação de veículos automotores",null,null,null,"45.1","45..1","9-02","-9-02","45..1-9-02","45..1-9-02"]
[null,null,"45.2",null,"","Manutenção e reparação de veículos automotores",null,null,null,"",".","","--",".--",""]
[null,null,null,"45.20-0","","Manutenção e reparação de veículos automotores",null,null,null,"",".","","--",".--",""]
[null,null,null,null,"45.20-0-01","Serviços de manutenção e reparação mecânica de veículos automotores",null,null,null,"45.2","45..2","0-01","-0-01","45..2-0-01","45..2-0-01"]
[null,null,null,null,"45.20-0-02","Serviços de lanternagem ou funilaria e pintura de veículos automotores",null,null,null,"45.2","45..2","0-02","-0-02","45..2-0-02","45..2-0-02"]
[null,null,null,null,"45.20-0-03","Serviços de manutenção e reparação elétrica de veículos automotores",null,null,null,"45.2","45..2","0-03","-0-03","45..2-0-03","45..2-0-03"]
[null,null,null,null,"45.20-0-04","Serviços de alinhamento e balanceamento de veículos automotores",null,null,null,"45.2","45..2","0-04","-0-04","45..2-0-04","45..2-0-04"]
[null,null,null,null,"45.20-0-05","Serviços de lavagem, lubrificação e polimento de veículos automotores",null,null,null,"45.2","45..2","0-05","-0-05","45..2-0-05","45..2-0-05"]
[null,null,null,null,"45.20-0-06","Serviços de borracharia para veículos automotores",null,null,null,"45.2","45..2","0-06","-0-06","45..2-0-06","45..2-0-06"]
[null,null,null,null,"45.20-0-07","Serviços de instalação, manutenção e reparação de acessórios para veículos automotores",null,null,null,"45.2","45..2","0-07","-0-07","45..2-0-07","45..2-0-07"]
[null,null,null,null,"45.20-0-08","Serviços de capotaria",null,null,null,"45.2","45..2","0-08","-0-08","45..2-0-08","45..2-0-08"]
[null,null,"45.3",null,"","Comércio de peças e acessórios para veículos automotores",null,null,null,"",".","","--",".--",""]
[null,null,null,"45.30-7","","Comércio de peças e acessórios para veículos automotores",null,null,null,"",".","","--",".--",""]
[null,null,null,null,"45.30-7-01","Comércio por atacado de peças e acessórios novos para veículos automotores",null,null,null,"45.3","45..3","7-01","-7-01","45..3-7-01","45..3-7-01"]
[null,null,null,null,"45.30-7-02","Comércio por atacado de pneumáticos e câmaras-de-ar",null,null,null,"45.3","45..3","7-02","-7-02","45..3-7-02","45..3-7-02"]
[null,null,null,null,"45.30-7-03","Comércio a varejo de peças e acessórios novos para veículos automotores",null,null,null,"45.3","45..3","7-03","-7-03","45..3-7-03","45..3-7-03"]
[null,null,null,null,"45.30-7-04","Comércio a varejo de peças e acessórios usados para veículos automotores",null,null,null,"45.3","45..3","7-04","-7-04","45..3-7-04","45..3-7-04"]
[null,null,null,null,"45.30-7-05","Comércio a varejo de pneumáticos e câmaras-de-ar",null,null,null,{"$f":"LEFT(E1223,4)","v":"45.3"},{"$f":"CONCATENATE(LEFT(J1223,2),\".\",RIGHT(J1223,2))","v":"45..3"},{"$f":"RIGHT(E1223,4)","v":"7-05"},{"$f":"CONCATENATE(\"-\",LEFT(L1223,1),\"-\",RIGHT(L1223,2))","v":"-7-05"},{"$f":"CONCATENATE(K1223,M1223)","v":"45..3-7-05"},"45..3-7-05"]
[null,null,null,null,"45.30-7-06","Representantes comerciais e agentes do comércio de peças e acessórios novos e usados para veículos automotores",null,null,null,"45.3","45..3","7-06","-7-06","45..3-7-06","45..3-7-06"]
[null,null,"45.4",null,"","Comércio, manutenção e reparação de motocicletas, peças e acessórios",null,null,null,"",".","","--",".--",""]
[null,null,null,"45.41-2","","Comércio por atacado e a varejo de motocicletas, peças e acessórios",null,null,null,"",".","","--",".--",""]
[null,null,null,null,"45.41-2-01","Comércio por atacado de motocicletas e motonetas",null,null,null,"45.4","45..4","2-01","-2-01","45..4-2-01",{"$f":"IF(LEN(N1227)=10,N1227,\"\")","v":"45..4-2-01"}]
[null,null,null,null,"45.41-2-02","Comércio por atacado de peças e acessórios para motocicletas e motonetas",null,null,null,"45.4","45..4","2-02","-2-02","45..4-2-02","45..4-2-02"]
[null,null,null,null,"45.41-2-03","Comércio a varejo de motocicletas e motonetas novas",null,null,null,"45.4","45..4","2-03","-2-03","45..4-2-03","45..4-2-03"]
[null,null,null,null,"45.41-2-04","Comércio a varejo de motocicletas e motonetas usadas",null,null,null,"45.4","45..4","2-04","-2-04","45..4-2-04","45..4-2-04"]
[null,null,null,null,"45.41-2-06","Comércio a varejo de peças e acessórios novos para motocicletas e motonetas",null,null,null,"45.4","45..4","2-06","-2-06","45..4-2-06","45..4-2-06"]
[null,null,null,null,"45.41-2-07","Comércio a varejo de peças e acessórios usados para motocicletas e motonetas",null,null,null,"45.4","45..4","2-07","-2-07","45..4-2-07","45..4-2-07"]
[null,null,null,"45.42-1","","Representantes comerciais e agentes do comércio de motocicletas, peças e acessórios",null,null,null,"",".","","--",".--",""]
[null,null,null,null,"45.42-1-01","Representantes comerciais e agentes do comércio de motocicletas e motonetas, peças e acessórios",null,null,null,"45.4","45..4","1-01","-1-01","45..4-1-01","45..4-1-01"]
[null,null,null,null,"45.42-1-02","Comércio sob consignação de motocicletas e motonetas",null,null,null,"45.4","45..4","1-02","-1-02","45..4-1-02","45..4-1-02"]
[null,null,null,"45.43-9","","Manutenção e reparação de motocicletas",null,null,null,"",".","","--",".--",""]
[null,null,null,null,"45.43-9-00","Manutenção e reparação de motocicletas e motonetas",null,null,null,"45.4","45..4","9-00","-9-00","45..4-9-00","45..4-9-00"]
[null,"46",null,null,"","COMÉRCIO POR ATACADO, EXCETO VEÍCULOS AUTOMOTORES E MOTOCICLETAS",null,null,null,"",".","","--",".--",""]
[null,null,"46.1",null,"","Representantes comerciais e agentes do comércio, exceto de veículos automotores e motocicletas",null,null,null,"",".","","--",".--",""]
[null,null,null,"46.11-7","","Representantes comerciais e agentes do comércio de matérias-primas agrícolas e animais vivos",null,null,null,"",".","","--",".--",""]
[null,null,null,null,"46.11-7-00","Representantes comerciais e agentes do comércio de matérias-primas agrícolas e animais vivos",null,null,null,"46.1","46..1","7-00","-7-00","46..1-7-00","46..1-7-00"]
[null,null,null,"46.12-5","","Representantes comerciais e agentes do comércio de combustíveis, minerais, produtos siderúrgicos e químicos",null,null,null,"",".","","--",".--",""]
[null,null,null,null,"46.12-5-00","Representantes comerciais e agentes do comércio de combustíveis, minerais, produtos siderúrgicos e químicos",null,null,null,"46.1","46..1","5-00","-5-00","46..1-5-00","46..1-5-00"]
[null,null,null,"46.13-3","","Representantes comerciais e agentes do comércio de madeira, material de construção e ferragens",null,null,null,"",".","","--",".--",""]
[null,null,null,null,"46.13-3-00","Representantes comerciais e agentes do comércio de madeira, material de construção e ferragens",null,null,null,"46.1","46..1","3-00","-3-00","46..1-3-00","46..1-3-00"]
[null,null,null,"46.14-1","","Representantes comerciais e agentes do comércio de máquinas, equipamentos, embarcações e aeronaves",null,null,null,"",".","","--",".--",""]
[null,null,null,null,"46.14-1-00","Representantes comerciais e agentes do comércio de máquinas, equipamentos, embarcações e aeronaves",null,null,null,"46.1","46..1","1-00","-1-00","46..1-1-00","46..1-1-00"]
[null,null,null,"46.15-0","","Representantes comerciais e agentes do comércio de eletrodomésticos, móveis e artigos de uso doméstico",null,null,null,"",".","","--",".--",""]
[null,null,null,null,"46.15-0-00","Representantes comerciais e agentes do comércio de eletrodomésticos, móveis e artigos de uso doméstico",null,null,null,"46.1","46..1","0-00","-0-00","46..1-0-00","46..1-0-00"]
[null,null,null,"46.16-8","","Representantes comerciais e agentes do comércio de têxteis, vestuário, calçados e artigos de viagem",null,null,null,"",".","","--",".--",""]
[null,null,null,null,"46.16-8-00","Representantes comerciais e agentes do comércio de têxteis, vestuário, calçados e artigos de viagem",null,null,null,"46.1","46..1","8-00","-8-00","46..1-8-00","46..1-8-00"]
[null,null,null,"46.17-6","","Representantes comerciais e agentes do comércio de produtos alimentícios, bebidas e fumo",null,null,null,"",".","","--",".--",""]
[null,null,null,null,"46.17-6-00","Representantes comerciais e agentes do comércio de produtos alimentícios, bebidas e fumo",null,null,null,"46.1","46..1","6-00","-6-00","46..1-6-00","46..1-6-00"]
[null,null,null,"46.18-4","","Representantes comerciais e agentes do comércio especializado em produtos não especificados anteriormente",null,null,null,"",".","","--",".--",""]
[null,null,null,null,"46.18-4-01","Representantes comerciais e agentes do comércio de medicamentos, cosméticos e produtos de perfumaria",null,null,null,"46.1","46..1","4-01","-4-01","46..1-4-01","46..1-4-01"]
[null,null,null,null,"46.18-4-02","Representantes comerciais e agentes do comércio de instrumentos e materiais odonto-médico-hospitalares",null,null,null,"46.1","46..1","4-02","-4-02","46..1-4-02","46..1-4-02"]
[null,null,null,null,"46.18-4-03","Representantes comerciais e agentes do comércio de jornais, revistas e outras publicações",null,null,null,"46.1","46..1","4-03","-4-03","46..1-4-03","46..1-4-03"]
[null,null,null,null,"46.18-4-99","Outros representantes comerciais e agentes do comércio especializado em produtos não especificados anteriormente",null,null,null,"46.1","46..1","4-99","-4-99","46..1-4-99","46..1-4-99"]
[null,null,null,"46.19-2","","Representantes comerciais e agentes do comércio de mercadorias em geral não especializado",null,null,null,"",".","","--",".--",""]
[null,null,null,null,"46.19-2-00","Representantes comerciais e agentes do comércio de mercadorias em geral não especializado",null,null,null,"46.1","46..1","2-00","-2-00","46..1-2-00","46..1-2-00"]
[null,null,"46.2",null,"","Comércio atacadista de matérias-primas agrícolas e animais vivos",null,null,null,"",".","","--",".--",""]
[null,null,null,"46.21-4","","Comércio atacadista de café em grão",null,null,null,"",".","","--",".--",""]
[null,null,null,null,"46.21-4-00","Comércio atacadista de café em grão",null,null,null,"46.2","46..2","4-00","-4-00","46..2-4-00","46..2-4-00"]
[null,null,null,"46.22-2","","Comércio atacadista de soja",null,null,null,"",".","","--",".--",""]
[null,null,null,null,"46.22-2-00","Comércio atacadista de soja",null,null,null,"46.2","46..2","2-00","-2-00","46..2-2-00","46..2-2-00"]
[null,null,null,"46.23-1","","Comércio atacadista de animais vivos, alimentos para animais e matérias-primas agrícolas, exceto café e soja",null,null,null,"",".","","--",".--",""]
[null,null,null,null,"46.23-1-01","Comércio atacadista de animais vivos",null,null,null,"46.2","46..2","1-01","-1-01","46..2-1-01","46..2-1-01"]
[null,null,null,null,"46.23-1-02","Comércio atacadista de couros, lãs, peles e outros subprodutos não comestíveis de origem animal",null,null,null,"46.2","46..2","1-02","-1-02","46..2-1-02","46..2-1-02"]
[null,null,null,null,"46.23-1-03","Comércio atacadista de algodão",null,null,null,"46.2","46..2","1-03","-1-03","46..2-1-03","46..2-1-03"]
[null,null,null,null,"46.23-1-04","Comércio atacadista de fumo em folha não beneficiado",null,null,null,"46.2","46..2","1-04","-1-04","46..2-1-04","46..2-1-04"]
[null,null,null,null,"46.23-1-05","Comércio atacadista de cacau",null,null,null,"46.2","46..2","1-05","-1-05","46..2-1-05","46..2-1-05"]
[null,null,null,null,"46.23-1-06","Comércio atacadista de sementes, flores, plantas e gramas",null,null,null,"46.2","46..2","1-06","-1-06","46..2-1-06","46..2-1-06"]
[null,null,null,null,"46.23-1-07","Comércio atacadista de sisal",null,null,null,"46.2","46..2","1-07","-1-07","46..2-1-07","46..2-1-07"]
[null,null,null,null,"46.23-1-08","Comércio atacadista de matérias-primas agrícolas com atividade de fracionamento e acondicionamento associada",null,null,null,"46.2","46..2","1-08","-1-08","46..2-1-08","46..2-1-08"]
[null,null,null,null,"46.23-1-09","Comércio atacadista de alimentos para animais",null,null,null,"46.2","46..2","1-09","-1-09","46..2-1-09","46..2-1-09"]
[null,null,null,null,"46.23-1-99","Comércio atacadista de matérias-primas agrícolas não especificadas anteriormente",null,null,null,"46.2","46..2","1-99","-1-99","46..2-1-99","46..2-1-99"]
[null,null,"46.3",null,"","Comércio atacadista especializado em produtos alimentícios, bebidas e fumo",null,null,null,"",".","","--",".--",""]
[null,null,null,"46.31-1","","Comércio atacadista de leite e laticínios",null,null,null,"",".","","--",".--",""]
[null,null,null,null,"46.31-1-00","Comércio atacadista de leite e laticínios",null,null,null,"46.3","46..3","1-00","-1-00","46..3-1-00","46..3-1-00"]
[null,null,null,"46.32-0","","Comércio atacadista de cereais e leguminosas beneficiados, farinhas, amidos e féculas",null,null,null,"",".","","--",".--",""]
[null,null,null,null,"46.32-0-01","Comércio atacadista de cereais e leguminosas beneficiados",null,null,null,"46.3","46..3","0-01","-0-01","46..3-0-01","46..3-0-01"]
[null,null,null,null,"46.32-0-02","Comércio atacadista de farinhas, amidos e féculas",null,null,null,"46.3","46..3","0-02","-0-02","46..3-0-02","46..3-0-02"]
[null,null,null,null,"46.32-0-03","Comércio atacadista de cereais e leguminosas beneficiados, farinhas, amidos e féculas, com atividade de fracionamento e acondicionamento associada",null,null,null,"46.3","46..3","0-03","-0-03","46..3-0-03","46..3-0-03"]
[null,null,null,"46.33-8","","Comércio atacadista de hortifrutigranjeiros",null,null,null,"",".","","--",".--",""]
[null,null,null,null,"46.33-8-01","Comércio atacadista de frutas, verduras, raízes, tubérculos, hortaliças e legumes frescos",null,null,null,"46.3","46..3","8-01","-8-01","46..3-8-01","46..3-8-01"]
[null,null,null,null,"46.33-8-02","Comércio atacadista de aves vivas e ovos",null,null,null,"46.3","46..3","8-02","-8-02","46..3-8-02","46..3-8-02"]
[null,null,null,null,"46.33-8-03","Comércio atacadista de coelhos e outros pequenos animais vivos para alimentação",null,null,null,{"$f":"LEFT(E1287,4)","v":"46.3"},{"$f":"CONCATENATE(LEFT(J1287,2),\".\",RIGHT(J1287,2))","v":"46..3"},{"$f":"RIGHT(E1287,4)","v":"8-03"},{"$f":"CONCATENATE(\"-\",LEFT(L1287,1),\"-\",RIGHT(L1287,2))","v":"-8-03"},{"$f":"CONCATENATE(K1287,M1287)","v":"46..3-8-03"},"46..3-8-03"]
[null,null,null,"46.34-6","","Comércio atacadista de carnes, produtos da carne e pescado",null,null,null,"",".","","--",".--",""]
[null,null,null,null,"46.34-6-01","Comércio atacadista de carnes bovinas e suínas e derivados",null,null,null,"46.3","46..3","6-01","-6-01","46..3-6-01","46..3-6-01"]
[null,null,null,null,"46.34-6-02","Comércio atacadista de aves abatidas e derivados",null,null,null,"46.3","46..3","6-02","-6-02","46..3-6-02","46..3-6-02"]
[null,null,null,null,"46.34-6-03","Comércio atacadista de pescados e frutos do mar",null,null,null,"46.3","46..3","6-03","-6-03","46..3-6-03",{"$f":"IF(LEN(N1291)=10,N1291,\"\")","v":"46..3-6-03"}]
[null,null,null,null,"46.34-6-99","Comércio atacadista de carnes e derivados de outros animais",null,null,null,"46.3","46..3","6-99","-6-99","46..3-6-99","46..3-6-99"]
[null,null,null,"46.35-4","","Comércio atacadista de bebidas",null,null,null,"",".","","--",".--",""]
[null,null,null,null,"46.35-4-01","Comércio atacadista de água mineral",null,null,null,"46.3","46..3","4-01","-4-01","46..3-4-01","46..3-4-01"]
[null,null,null,null,"46.35-4-02","Comércio atacadista de cerveja, chope e refrigerante",null,null,null,"46.3","46..3","4-02","-4-02","46..3-4-02","46..3-4-02"]
[null,null,null,null,"46.35-4-03","Comércio atacadista de bebidas com atividade de fracionamento e acondicionamento associada",null,null,null,"46.3","46..3","4-03","-4-03","46..3-4-03","46..3-4-03"]
[null,null,null,null,"46.35-4-99","Comércio atacadista de bebidas não especificadas anteriormente",null,null,null,"46.3","46..3","4-99","-4-99","46..3-4-99","46..3-4-99"]
[null,null,null,"46.36-2","","Comércio atacadista de produtos do fumo",null,null,null,"",".","","--",".--",""]
[null,null,null,null,"46.36-2-01","Comércio atacadista de fumo beneficiado",null,null,null,"46.3","46..3","2-01","-2-01","46..3-2-01","46..3-2-01"]
[null,null,null,null,"46.36-2-02","Comércio atacadista de cigarros, cigarrilhas e charutos",null,null,null,"46.3","46..3","2-02","-2-02","46..3-2-02","46..3-2-02"]
[null,null,null,"46.37-1","","Comércio atacadista especializado em produtos alimentícios não especificados anteriormente",null,null,null,"",".","","--",".--",""]
[null,null,null,null,"46.37-1-01","Comércio atacadista de café torrado, moído e solúvel",null,null,null,"46.3","46..3","1-01","-1-01","46..3-1-01","46..3-1-01"]
[null,null,null,null,"46.37-1-02","Comércio atacadista de açúcar",null,null,null,"46.3","46..3","1-02","-1-02","46..3-1-02","46..3-1-02"]
[null,null,null,null,"46.37-1-03","Comércio atacadista de óleos e gorduras",null,null,null,"46.3","46..3","1-03","-1-03","46..3-1-03","46..3-1-03"]
[null,null,null,null,"46.37-1-04","Comércio atacadista de pães, bolos, biscoitos e similares",null,null,null,"46.3","46..3","1-04","-1-04","46..3-1-04","46..3-1-04"]
[null,null,null,null,"46.37-1-05","Comércio atacadista de massas alimentícias",null,null,null,"46.3","46..3","1-05","-1-05","46..3-1-05","46..3-1-05"]
[null,null,null,null,"46.37-1-06","Comércio atacadista de sorvetes",null,null,null,"46.3","46..3","1-06","-1-06","46..3-1-06","46..3-1-06"]
[null,null,null,null,"46.37-1-07","Comércio atacadista de chocolates, confeitos, balas, bombons e semelhantes",null,null,null,"46.3","46..3","1-07","-1-07","46..3-1-07","46..3-1-07"]
[null,null,null,null,"46.37-1-99","Comércio atacadista especializado em outros produtos alimentícios não especificados anteriormente",null,null,null,"46.3","46..3","1-99","-1-99","46..3-1-99","46..3-1-99"]
[null,null,null,"46.39-7","","Comércio atacadista de produtos alimentícios em geral",null,null,null,"",".","","--",".--",""]
[null,null,null,null,"46.39-7-01","Comércio atacadista de produtos alimentícios em geral",null,null,null,"46.3","46..3","7-01","-7-01","46..3-7-01","46..3-7-01"]
[null,null,null,null,"46.39-7-02","Comércio atacadista de produtos alimentícios em geral, com atividade de fracionamento e acondicionamento associada",null,null,null,"46.3","46..3","7-02","-7-02","46..3-7-02","46..3-7-02"]
[null,null,"46.4",null,"","Comércio atacadista de produtos de consumo não alimentar",null,null,null,"",".","","--",".--",""]
[null,null,null,"46.41-9","","Comércio atacadista de tecidos, artefatos de tecidos e de armarinho",null,null,null,"",".","","--",".--",""]
[null,null,null,null,"46.41-9-01","Comércio atacadista de tecidos",null,null,null,"46.4","46..4","9-01","-9-01","46..4-9-01","46..4-9-01"]
[null,null,null,null,"46.41-9-02","Comércio atacadista de artigos de cama, mesa e banho",null,null,null,"46.4","46..4","9-02","-9-02","46..4-9-02","46..4-9-02"]
[null,null,null,null,"46.41-9-03","Comércio atacadista de artigos de armarinho",null,null,null,"46.4","46..4","9-03","-9-03","46..4-9-03","46..4-9-03"]
[null,null,null,"46.42-7","","Comércio atacadista de artigos do vestuário e acessórios",null,null,null,"",".","","--",".--",""]
[null,null,null,null,"46.42-7-01","Comércio atacadista de artigos do vestuário e acessórios, exceto profissionais e de segurança",null,null,null,"46.4","46..4","7-01","-7-01","46..4-7-01","46..4-7-01"]
[null,null,null,null,"46.42-7-02","Comércio atacadista de roupas e acessórios para uso profissional e de segurança do trabalho",null,null,null,"46.4","46..4","7-02","-7-02","46..4-7-02","46..4-7-02"]
[null,null,null,"46.43-5","","Comércio atacadista de calçados e artigos de viagem",null,null,null,"",".","","--",".--",""]
[null,null,null,null,"46.43-5-01","Comércio atacadista de calçados",null,null,null,"46.4","46..4","5-01","-5-01","46..4-5-01","46..4-5-01"]
[null,null,null,null,"46.43-5-02","Comércio atacadista de bolsas, malas e artigos de viagem",null,null,null,"46.4","46..4","5-02","-5-02","46..4-5-02","46..4-5-02"]
[null,null,null,"46.44-3","","Comércio atacadista de produtos farmacêuticos para uso humano e veterinário",null,null,null,"",".","","--",".--",""]
[null,null,null,null,"46.44-3-01","Comércio atacadista de medicamentos e drogas de uso humano",null,null,null,"46.4","46..4","3-01","-3-01","46..4-3-01","46..4-3-01"]
[null,null,null,null,"46.44-3-02","Comércio atacadista de medicamentos e drogas de uso veterinário",null,null,null,"46.4","46..4","3-02","-3-02","46..4-3-02","46..4-3-02"]
[null,null,null,"46.45-1","","Comércio atacadista de instrumentos e materiais para uso médico, cirúrgico, ortopédico e odontológico",null,null,null,"",".","","--",".--",""]
[null,null,null,null,"46.45-1-01","Comércio atacadista de instrumentos e materiais para uso médico, cirúrgico, hospitalar e de laboratórios",null,null,null,"46.4","46..4","1-01","-1-01","46..4-1-01","46..4-1-01"]
[null,null,null,null,"46.45-1-02","Comércio atacadista de próteses e artigos de ortopedia",null,null,null,"46.4","46..4","1-02","-1-02","46..4-1-02","46..4-1-02"]
[null,null,null,null,"46.45-1-03","Comércio atacadista de produtos odontológicos",null,null,null,"46.4","46..4","1-03","-1-03","46..4-1-03","46..4-1-03"]
[null,null,null,"46.46-0","","Comércio atacadista de cosméticos, produtos de perfumaria e de higiene pessoal",null,null,null,"",".","","--",".--",""]
[null,null,null,null,"46.46-0-01","Comércio atacadista de cosméticos e produtos de perfumaria",null,null,null,"46.4","46..4","0-01","-0-01","46..4-0-01","46..4-0-01"]
[null,null,null,null,"46.46-0-02","Comércio atacadista de produtos de higiene pessoal",null,null,null,"46.4","46..4","0-02","-0-02","46..4-0-02","46..4-0-02"]
[null,null,null,"46.47-8","","Comércio atacadista de artigos de escritório e de papelaria; livros, jornais e outras publicações",null,null,null,"",".","","--",".--",""]
[null,null,null,null,"46.47-8-01","Comércio atacadista de artigos de escritório e de papelaria",null,null,null,"46.4","46..4","8-01","-8-01","46..4-8-01","46..4-8-01"]
[null,null,null,null,"46.47-8-02","Comércio atacadista de livros, jornais e outras publicações",null,null,null,"46.4","46..4","8-02","-8-02","46..4-8-02","46..4-8-02"]
[null,null,null,"46.49-4","","Comércio atacadista de equipamentos e artigos de uso pessoal e doméstico não especificados anteriormente",null,null,null,"",".","","--",".--",""]
[null,null,null,null,"46.49-4-01","Comércio atacadista de equipamentos elétricos de uso pessoal e doméstico",null,null,null,"46.4","46..4","4-01","-4-01","46..4-4-01","46..4-4-01"]
[null,null,null,null,"46.49-4-02","Comércio atacadista de aparelhos eletrônicos de uso pessoal e doméstico",null,null,null,"46.4","46..4","4-02","-4-02","46..4-4-02","46..4-4-02"]
[null,null,null,null,"46.49-4-03","Comércio atacadista de bicicletas, triciclos e outros veículos recreativos",null,null,null,"46.4","46..4","4-03","-4-03","46..4-4-03","46..4-4-03"]
[null,null,null,null,"46.49-4-04","Comércio atacadista de móveis e artigos de colchoaria",null,null,null,"46.4","46..4","4-04","-4-04","46..4-4-04","46..4-4-04"]
[null,null,null,null,"46.49-4-05","Comércio atacadista de artigos de tapeçaria; persianas e cortinas",null,null,null,"46.4","46..4","4-05","-4-05","46..4-4-05","46..4-4-05"]
[null,null,null,null,"46.49-4-06","Comércio atacadista de lustres, luminárias e abajures",null,null,null,"46.4","46..4","4-06","-4-06","46..4-4-06","46..4-4-06"]
[null,null,null,null,"46.49-4-07","Comércio atacadista de filmes, CDs, DVDs, fitas e discos",null,null,null,"46.4","46..4","4-07","-4-07","46..4-4-07","46..4-4-07"]
[null,null,null,null,"46.49-4-08","Comércio atacadista de produtos de higiene, limpeza e conservação domiciliar",null,null,null,"46.4","46..4","4-08","-4-08","46..4-4-08","46..4-4-08"]
[null,null,null,null,"46.49-4-09","Comércio atacadista de produtos de higiene, limpeza e conservação domiciliar, com atividade de fracionamento e acondicionamento associada",null,null,null,"46.4","46..4","4-09","-4-09","46..4-4-09","46..4-4-09"]
[null,null,null,null,"46.49-4-10","Comércio atacadista de jóias, relógios e bijuterias, inclusive pedras preciosas e semipreciosas lapidadas",null,null,null,"46.4","46..4","4-10","-4-10","46..4-4-10","46..4-4-10"]
[null,null,null,null,"46.49-4-99","Comércio atacadista de outros equipamentos e artigos de uso pessoal e doméstico não especificados anteriormente",null,null,null,"46.4","46..4","4-99","-4-99","46..4-4-99","46..4-4-99"]
[null,null,"46.5",null,"","Comércio atacadista de equipamentos e produtos de tecnologias de informação e comunicação",null,null,null,"",".","","--",".--",""]
[null,null,null,"46.51-6","","Comércio atacadista de computadores, periféricos e suprimentos de informática",null,null,null,"",".","","--",".--",""]
[null,null,null,null,"46.51-6-01","Comércio atacadista de equipamentos de informática",null,null,null,{"$f":"LEFT(E1351,4)","v":"46.5"},{"$f":"CONCATENATE(LEFT(J1351,2),\".\",RIGHT(J1351,2))","v":"46..5"},{"$f":"RIGHT(E1351,4)","v":"6-01"},{"$f":"CONCATENATE(\"-\",LEFT(L1351,1),\"-\",RIGHT(L1351,2))","v":"-6-01"},{"$f":"CONCATENATE(K1351,M1351)","v":"46..5-6-01"},"46..5-6-01"]
[null,null,null,null,"46.51-6-02","Comércio atacadista de suprimentos para informática",null,null,null,"46.5","46..5","6-02","-6-02","46..5-6-02","46..5-6-02"]
[null,null,null,"46.52-4","","Comércio atacadista de componentes eletrônicos e equipamentos de telefonia e comunicação",null,null,null,"",".","","--",".--",""]
[null,null,null,null,"46.52-4-00","Comércio atacadista de componentes eletrônicos e equipamentos de telefonia e comunicação",null,null,null,"46.5","46..5","4-00","-4-00","46..5-4-00","46..5-4-00"]
[null,null,"46.6",null,"","Comércio atacadista de máquinas, aparelhos e equipamentos, exceto de tecnologias de informação e comunicação",null,null,null,"",".","","--",".--",{"$f":"IF(LEN(N1355)=10,N1355,\"\")","v":""}]
[null,null,null,"46.61-3","","Comércio atacadista de máquinas, aparelhos e equipamentos para uso agropecuário; partes e peças",null,null,null,"",".","","--",".--",""]
[null,null,null,null,"46.61-3-00","Comércio atacadista de máquinas, aparelhos e equipamentos para uso agropecuário; partes e peças",null,null,null,"46.6","46..6","3-00","-3-00","46..6-3-00","46..6-3-00"]
[null,null,null,"46.62-1","","Comércio atacadista de máquinas, equipamentos para terraplenagem, mineração e construção; partes e peças",null,null,null,"",".","","--",".--",""]
[null,null,null,null,"46.62-1-00","Comércio atacadista de máquinas, equipamentos para terraplenagem, mineração e construção; partes e peças","SIM",null,null,"46.6","46..6","1-00","-1-00","46..6-1-00","46..6-1-00"]
[null,null,null,"46.63-0","","Comércio atacadista de máquinas e equipamentos para uso industrial; partes e peças",null,null,null,"",".","","--",".--",""]
[null,null,null,null,"46.63-0-00","Comércio atacadista de máquinas e equipamentos para uso industrial; partes e peças","SIM",null,null,"46.6","46..6","0-00","-0-00","46..6-0-00","46..6-0-00"]
[null,null,null,"46.64-8","","Comércio atacadista de máquinas, aparelhos e equipamentos para uso odonto-médico-hospitalar; partes e peças",null,null,null,"",".","","--",".--",""]
[null,null,null,null,"46.64-8-00","Comércio atacadista de máquinas, aparelhos e equipamentos para uso odonto-médico-hospitalar; partes e peças",null,null,null,"46.6","46..6","8-00","-8-00","46..6-8-00","46..6-8-00"]
[null,null,null,"46.65-6","","Comércio atacadista de máquinas e equipamentos para uso comercial; partes e peças",null,null,null,"",".","","--",".--",""]
[null,null,null,null,"46.65-6-00","Comércio atacadista de máquinas e equipamentos para uso comercial; partes e peças",null,null,null,"46.6","46..6","6-00","-6-00","46..6-6-00","46..6-6-00"]
[null,null,null,"46.69-9","","Comércio atacadista de máquinas, aparelhos e equipamentos não especificados anteriormente; partes e peças",null,null,null,"",".","","--",".--",""]
[null,null,null,null,"46.69-9-01","Comércio atacadista de bombas e compressores; partes e peças","SIM",null,null,"46.6","46..6","9-01","-9-01","46..6-9-01","46..6-9-01"]
[null,null,null,null,"46.69-9-99","Comércio atacadista de outras máquinas e equipamentos não especificados anteriormente; partes e peças",null,null,null,"46.6","46..6","9-99","-9-99","46..6-9-99","46..6-9-99"]
[null,null,"46.7",null,"","Comércio atacadista de madeira, ferragens, ferramentas, material elétrico e material de construção",null,null,null,"",".","","--",".--",""]
[null,null,null,"46.71-1","","Comércio atacadista de madeira e produtos derivados",null,null,null,"",".","","--",".--",""]
[null,null,null,null,"46.71-1-00","Comércio atacadista de madeira e produtos derivados",null,null,null,"46.7","46..7","1-00","-1-00","46..7-1-00","46..7-1-00"]
[null,null,null,"46.72-9","","Comércio atacadista de ferragens e ferramentas",null,null,null,"",".","","--",".--",""]
[null,null,null,null,"46.72-9-00","Comércio atacadista de ferragens e ferramentas","SIM",null,null,"46.7","46..7","9-00","-9-00","46..7-9-00","46..7-9-00"]
[null,null,null,"46.73-7","","Comércio atacadista de material elétrico",null,null,null,"",".","","--",".--",""]
[null,null,null,null,"46.73-7-00","Comércio atacadista de material elétrico","SIM",null,null,"46.7","46..7","7-00","-7-00","46..7-7-00","46..7-7-00"]
[null,null,null,"46.74-5","","Comércio atacadista de cimento",null,null,null,"",".","","--",".--",""]
[null,null,null,null,"46.74-5-00","Comércio atacadista de cimento","SIM",null,null,"46.7","46..7","5-00","-5-00","46..7-5-00","46..7-5-00"]
[null,null,null,"46.79-6","","Comércio atacadista especializado de materiais de construção não especificados anteriormente e de materiais de construção em geral",null,null,null,"",".","","--",".--",""]
[null,null,null,null,"46.79-6-01","Comércio atacadista de tintas, vernizes e similares","SIM",null,null,"46.7","46..7","6-01","-6-01","46..7-6-01","46..7-6-01"]
[null,null,null,null,"46.79-6-02","Comércio atacadista de mármores e granitos","SIM",null,null,"46.7","46..7","6-02","-6-02","46..7-6-02","46..7-6-02"]
[null,null,null,null,"46.79-6-03","Comércio atacadista de vidros, espelhos e vitrais","SIM",null,null,"46.7","46..7","6-03","-6-03","46..7-6-03","46..7-6-03"]
[null,null,null,null,"46.79-6-04","Comércio atacadista especializado de materiais de construção não especificados anteriormente","SIM",null,null,"46.7","46..7","6-04","-6-04","46..7-6-04","46..7-6-04"]
[null,null,null,null,"46.79-6-99","Comércio atacadista de materiais de construção em geral","SIM",null,null,"46.7","46..7","6-99","-6-99","46..7-6-99","46..7-6-99"]
[null,null,"46.8",null,"","Comércio atacadista especializado em outros produtos",null,null,null,"",".","","--",".--",""]
[null,null,null,"46.81-8","","Comércio atacadista de combustíveis sólidos, líquidos e gasosos, exceto gás natural e GLP",null,null,null,"",".","","--",".--",""]
[null,null,null,null,"46.81-8-01","Comércio atacadista de álcool carburante, biodiesel, gasolina e demais derivados de petróleo, exceto lubrificantes, não realizado por transportador retalhista (TRR)",null,null,null,"46.8","46..8","8-01","-8-01","46..8-8-01","46..8-8-01"]
[null,null,null,null,"46.81-8-02","Comércio atacadista de combustíveis realizado por transportador retalhista (TRR)",null,null,null,"46.8","46..8","8-02","-8-02","46..8-8-02","46..8-8-02"]
[null,null,null,null,"46.81-8-03","Comércio atacadista de combustíveis de origem vegetal, exceto álcool carburante",null,null,null,"46.8","46..8","8-03","-8-03","46..8-8-03","46..8-8-03"]
[null,null,null,null,"46.81-8-04","Comércio atacadista de combustíveis de origem mineral em bruto",null,null,null,"46.8","46..8","8-04","-8-04","46..8-8-04","46..8-8-04"]
[null,null,null,null,"46.81-8-05","Comércio atacadista de lubrificantes",null,null,null,"46.8","46..8","8-05","-8-05","46..8-8-05","46..8-8-05"]
[null,null,null,"46.82-6","","Comércio atacadista de gás liquefeito de petróleo (GLP)",null,null,null,"",".","","--",".--",""]
[null,null,null,null,"46.82-6-00","Comércio atacadista de gás liquefeito de petróleo (GLP)",null,null,null,"46.8","46..8","6-00","-6-00","46..8-6-00","46..8-6-00"]
[null,null,null,"46.83-4","","Comércio atacadista de defensivos agrícolas, adubos, fertilizantes e corretivos do solo",null,null,null,"",".","","--",".--",""]
[null,null,null,null,"46.83-4-00","Comércio atacadista de defensivos agrícolas, adubos, fertilizantes e corretivos do solo",null,null,null,"46.8","46..8","4-00","-4-00","46..8-4-00","46..8-4-00"]
[null,null,null,"46.84-2","","Comércio atacadista de produtos químicos e petroquímicos, exceto agroquímicos",null,null,null,"",".","","--",".--",""]
[null,null,null,null,"46.84-2-01","Comércio atacadista de resinas e elastômeros",null,null,null,"46.8","46..8","2-01","-2-01","46..8-2-01","46..8-2-01"]
[null,null,null,null,"46.84-2-02","Comércio atacadista de solventes",null,null,null,"46.8","46..8","2-02","-2-02","46..8-2-02","46..8-2-02"]
[null,null,null,null,"46.84-2-99","Comércio atacadista de outros produtos químicos e petroquímicos não especificados anteriormente",null,null,null,"46.8","46..8","2-99","-2-99","46..8-2-99","46..8-2-99"]
[null,null,null,"46.85-1","","Comércio atacadista de produtos siderúrgicos e metalúrgicos, exceto para construção",null,null,null,"",".","","--",".--",""]
[null,null,null,null,"46.85-1-00","Comércio atacadista de produtos siderúrgicos e metalúrgicos, exceto para construção",null,null,null,"46.8","46..8","1-00","-1-00","46..8-1-00","46..8-1-00"]
[null,null,null,"46.86-9","","Comércio atacadista de papel e papelão em bruto e de embalagens",null,null,null,"",".","","--",".--",""]
[null,null,null,null,"46.86-9-01","Comércio atacadista de papel e papelão em bruto",null,null,null,"46.8","46..8","9-01","-9-01","46..8-9-01","46..8-9-01"]
[null,null,null,null,"46.86-9-02","Comércio atacadista de embalagens",null,null,null,"46.8","46..8","9-02","-9-02","46..8-9-02","46..8-9-02"]
[null,null,null,"46.87-7","","Comércio atacadista de resíduos e sucatas",null,null,null,"",".","","--",".--",""]
[null,null,null,null,"46.87-7-01","Comércio atacadista de resíduos de papel e papelão",null,null,null,"46.8","46..8","7-01","-7-01","46..8-7-01","46..8-7-01"]
[null,null,null,null,"46.87-7-02","Comércio atacadista de resíduos e sucatas não metálicos, exceto de papel e papelão",null,null,null,"46.8","46..8","7-02","-7-02","46..8-7-02","46..8-7-02"]
[null,null,null,null,"46.87-7-03","Comércio atacadista de resíduos e sucatas metálicos",null,null,null,"46.8","46..8","7-03","-7-03","46..8-7-03","46..8-7-03"]
[null,null,null,"46.89-3","","Comércio atacadista especializado de outros produtos intermediários não especificados anteriormente",null,null,null,"",".","","--",".--",""]
[null,null,null,null,"46.89-3-01","Comércio atacadista de produtos da extração mineral, exceto combustíveis",null,null,null,"46.8","46..8","3-01","-3-01","46..8-3-01","46..8-3-01"]
[null,null,null,null,"46.89-3-02","Comércio atacadista de fios e fibras beneficiados",null,null,null,"46.8","46..8","3-02","-3-02","46..8-3-02","46..8-3-02"]
[null,null,null,null,"46.89-3-99","Comércio atacadista especializado em outros produtos intermediários não especificados anteriormente",null,null,null,"46.8","46..8","3-99","-3-99","46..8-3-99","46..8-3-99"]
[null,null,"46.9",null,"","Comércio atacadista não especializado",null,null,null,"",".","","--",".--",""]
[null,null,null,"46.91-5","","Comércio atacadista de mercadorias em geral, com predominância de produtos alimentícios",null,null,null,"",".","","--",".--",""]
[null,null,null,null,"46.91-5-00","Comércio atacadista de mercadorias em geral, com predominância de produtos alimentícios",null,null,null,"46.9","46..9","5-00","-5-00","46..9-5-00","46..9-5-00"]
[null,null,null,"46.92-3","","Comércio atacadista de mercadorias em geral, com predominância de insumos agropecuários",null,null,null,{"$f":"LEFT(E1415,4)","v":""},{"$f":"CONCATENATE(LEFT(J1415,2),\".\",RIGHT(J1415,2))","v":"."},{"$f":"RIGHT(E1415,4)","v":""},{"$f":"CONCATENATE(\"-\",LEFT(L1415,1),\"-\",RIGHT(L1415,2))","v":"--"},{"$f":"CONCATENATE(K1415,M1415)","v":".--"},""]
[null,null,null,null,"46.92-3-00","Comércio atacadista de mercadorias em geral, com predominância de insumos agropecuários",null,null,null,"46.9","46..9","3-00","-3-00","46..9-3-00","46..9-3-00"]
[null,null,null,"46.93-1","","Comércio atacadista de mercadorias em geral, sem predominância de alimentos ou de insumos agropecuários",null,null,null,"",".","","--",".--",""]
[null,null,null,null,"46.93-1-00","Comércio atacadista de mercadorias em geral, sem predominância de alimentos ou de insumos agropecuários",null,null,null,"46.9","46..9","1-00","-1-00","46..9-1-00","46..9-1-00"]
[null,"47",null,null,"","COMÉRCIO VAREJISTA",null,null,null,"",".","","--",".--",{"$f":"IF(LEN(N1419)=10,N1419,\"\")","v":""}]
[null,null,"47.1",null,"","Comércio varejista não especializado",null,null,null,"",".","","--",".--",""]
[null,null,null,"47.11-3","","Comércio varejista de mercadorias em geral, com predominância de produtos alimentícios - hipermercados e supermercados",null,null,null,"",".","","--",".--",""]
[null,null,null,null,"47.11-3-01","Comércio varejista de mercadorias em geral, com predominância de produtos alimentícios - hipermercados",null,null,null,"47.1","47..1","3-01","-3-01","47..1-3-01","47..1-3-01"]
[null,null,null,null,"47.11-3-02","Comércio varejista de mercadorias em geral, com predominância de produtos alimentícios - supermercados",null,null,null,"47.1","47..1","3-02","-3-02","47..1-3-02","47..1-3-02"]
[null,null,null,"47.12-1","","Comércio varejista de mercadorias em geral, com\npredominância de produtos alimentícios - minimercados,\nmercearias e armazéns",null,null,null,"",".","","--",".--",""]
[null,null,null,null,"47.12-1-00","Comércio varejista de mercadorias em geral, com predominância de produtos alimentícios - minimercados, mercearias e armazéns",null,null,null,"47.1","47..1","1-00","-1-00","47..1-1-00","47..1-1-00"]
[null,null,null,"47.13-0","","Comércio varejista de mercadorias em geral, sem predominância de produtos alimentícios",null,null,null,"",".","","--",".--",""]
[null,null,null,null,"47.13-0-02","Lojas de variedades, exceto lojas de departamentos ou magazines",null,null,null,"47.1","47..1","0-02","-0-02","47..1-0-02","47..1-0-02"]
[null,null,null,null,"47.13-0-04","Lojas de departamentos ou magazines, exceto lojas francas (Duty free)",null,null,null,"47.1","47..1","0-04","-0-04","47..1-0-04","47..1-0-04"]
[null,null,null,null,"47.13-0-05","Lojas francas (Duty Free) de aeroportos, portos e em fronteiras terrestres",null,null,null,"47.1","47..1","0-05","-0-05","47..1-0-05","47..1-0-05"]
[null,null,"47.2",null,"","Comércio varejista de produtos alimentícios, bebidas e fumo",null,null,null,"",".","","--",".--",""]
[null,null,null,"47.21-1","","Comércio varejista de produtos de padaria, laticínio, doces, balas e semelhantes",null,null,null,"",".","","--",".--",""]
[null,null,null,null,"47.21-1-02","Padaria e confeitaria com predominância de revenda",null,null,null,"47.2","47..2","1-02","-1-02","47..2-1-02","47..2-1-02"]
[null,null,null,null,"47.21-1-03","Comércio varejista de laticínios e frios",null,null,null,"47.2","47..2","1-03","-1-03","47..2-1-03","47..2-1-03"]
[null,null,null,null,"47.21-1-04","Comércio varejista de doces, balas, bombons e semelhantes",null,null,null,"47.2","47..2","1-04","-1-04","47..2-1-04","47..2-1-04"]
[null,null,null,"47.22-9","","Comércio varejista de carnes e pescados - açougues e peixarias",null,null,null,"",".","","--",".--",""]
[null,null,null,null,"47.22-9-01","Comércio varejista de carnes - açougues",null,null,null,"47.2","47..2","9-01","-9-01","47..2-9-01","47..2-9-01"]
[null,null,null,null,"47.22-9-02","Peixaria",null,null,null,"47.2","47..2","9-02","-9-02","47..2-9-02","47..2-9-02"]
[null,null,null,"47.23-7","","Comércio varejista de bebidas",null,null,null,"",".","","--",".--",""]
[null,null,null,null,"47.23-7-00","Comércio varejista de bebidas",null,null,null,"47.2","47..2","7-00","-7-00","47..2-7-00","47..2-7-00"]
[null,null,null,"47.24-5","","Comércio varejista de hortifrutigranjeiros",null,null,null,"",".","","--",".--",""]
[null,null,null,null,"47.24-5-00","Comércio varejista de hortifrutigranjeiros",null,null,null,"47.2","47..2","5-00","-5-00","47..2-5-00","47..2-5-00"]
[null,null,null,"47.29-6","","Comércio varejista de produtos alimentícios em geral ou especializado em produtos alimentícios não especificados anteriormente; produtos do fumo",null,null,null,"",".","","--",".--",""]
[null,null,null,null,"47.29-6-01","Tabacaria",null,null,null,"47.2","47..2","6-01","-6-01","47..2-6-01","47..2-6-01"]
[null,null,null,null,"47.29-6-02","Comércio varejista de mercadorias em lojas de conveniência",null,null,null,"47.2","47..2","6-02","-6-02","47..2-6-02","47..2-6-02"]
[null,null,null,null,"47.29-6-99","Comércio varejista de produtos alimentícios em geral ou especializado em produtos alimentícios não especificados anteriormente",null,null,null,"47.2","47..2","6-99","-6-99","47..2-6-99","47..2-6-99"]
[null,null,"47.3",null,"","Comércio varejista de combustíveis para veículos automotores",null,null,null,"",".","","--",".--",""]
[null,null,null,"47.31-8","","Comércio varejista de combustíveis para veículos automotores",null,null,null,"",".","","--",".--",""]
[null,null,null,null,"47.31-8-00","Comércio varejista de combustíveis para veículos automotores",null,null,null,"47.3","47..3","8-00","-8-00","47..3-8-00","47..3-8-00"]
[null,null,null,"47.32-6","","Comércio varejista de lubrificantes",null,null,null,"",".","","--",".--",""]
[null,null,null,null,"47.32-6-00","Comércio varejista de lubrificantes",null,null,null,"47.3","47..3","6-00","-6-00","47..3-6-00","47..3-6-00"]
[null,null,"47.4",null,"","Comércio varejista de material de construção",null,null,null,"",".","","--",".--",""]
[null,null,null,"47.41-5","","Comércio varejista de tintas e materiais para pintura",null,null,null,"",".","","--",".--",""]
[null,null,null,null,"47.41-5-00","Comércio varejista de tintas e materiais para pintura","SIM",null,null,"47.4","47..4","5-00","-5-00","47..4-5-00","47..4-5-00"]
[null,null,null,"47.42-3","","Comércio varejista de material elétrico",null,null,null,"",".","","--",".--",""]
[null,null,null,null,"47.42-3-00","Comércio varejista de material elétrico","SIM",null,null,"47.4","47..4","3-00","-3-00","47..4-3-00","47..4-3-00"]
[null,null,null,"47.43-1","","Comércio varejista de vidros",null,null,null,"",".","","--",".--",""]
[null,null,null,null,"47.43-1-00","Comércio varejista de vidros","SIM",null,null,"47.4","47..4","1-00","-1-00","47..4-1-00","47..4-1-00"]
[null,null,null,"47.44-0","","Comércio varejista de ferragens, madeira e materiais de construção",null,null,null,"",".","","--",".--",""]
[null,null,null,null,"47.44-0-01","Comércio varejista de ferragens e ferramentas","SIM",null,null,"47.4","47..4","0-01","-0-01","47..4-0-01","47..4-0-01"]
[null,null,null,null,"47.44-0-02","Comércio varejista de madeira e artefatos","SIM",null,null,"47.4","47..4","0-02","-0-02","47..4-0-02","47..4-0-02"]
[null,null,null,null,"47.44-0-03","Comércio varejista de materiais hidráulicos","SIM",null,null,"47.4","47..4","0-03","-0-03","47..4-0-03","47..4-0-03"]
[null,null,null,null,"47.44-0-04","Comércio varejista de cal, areia, pedra britada, tijolos e telhas","SIM",null,null,"47.4","47..4","0-04","-0-04","47..4-0-04","47..4-0-04"]
[null,null,null,null,"47.44-0-05","Comércio varejista de materiais de construção não especificados anteriormente","SIM",null,null,"47.4","47..4","0-05","-0-05","47..4-0-05","47..4-0-05"]
[null,null,null,null,"47.44-0-06","Comércio varejista de pedras para revestimento","SIM",null,null,"47.4","47..4","0-06","-0-06","47..4-0-06","47..4-0-06"]
[null,null,null,null,"47.44-0-99","Comércio varejista de materiais de construção em geral","SIM",null,null,"47.4","47..4","0-99","-0-99","47..4-0-99","47..4-0-99"]
[null,null,"47.5",null,"","Comércio varejista de equipamentos de informática e comunicação; equipamentos e artigos de uso doméstico",null,null,null,"",".","","--",".--",""]
[null,null,null,"47.51-2","","Comércio varejista especializado de equipamentos e suprimentos de informática",null,null,null,"",".","","--",".--",""]
[null,null,null,null,"47.51-2-01","Comércio varejista especializado de equipamentos e suprimentos de informática",null,null,null,"47.5","47..5","2-01","-2-01","47..5-2-01","47..5-2-01"]
[null,null,null,null,"47.51-2-02","Recarga de cartuchos para equipamentos de informática",null,null,null,"47.5","47..5","2-02","-2-02","47..5-2-02","47..5-2-02"]
[null,null,null,"47.52-1","","Comércio varejista especializado de equipamentos de telefonia e comunicação",null,null,null,"",".","","--",".--",""]
[null,null,null,null,"47.52-1-00","Comércio varejista especializado de equipamentos de telefonia e comunicação",null,null,null,"47.5","47..5","1-00","-1-00","47..5-1-00","47..5-1-00"]
[null,null,null,"47.53-9","","Comércio varejista especializado de eletrodomésticos e equipamentos de áudio e vídeo",null,null,null,"",".","","--",".--",""]
[null,null,null,null,"47.53-9-00","Comércio varejista especializado de eletrodomésticos e equipamentos de áudio e vídeo",null,null,null,"47.5","47..5","9-00","-9-00","47..5-9-00","47..5-9-00"]
[null,null,null,"47.54-7","","Comércio varejista especializado de móveis, colchoaria e artigos de iluminação",null,null,null,"",".","","--",".--",""]
[null,null,null,null,"47.54-7-01","Comércio varejista de móveis","SIM",null,null,"47.5","47..5","7-01","-7-01","47..5-7-01","47..5-7-01"]
[null,null,null,null,"47.54-7-02","Comércio varejista de artigos de colchoaria",null,null,null,"47.5","47..5","7-02","-7-02","47..5-7-02","47..5-7-02"]
[null,null,null,null,"47.54-7-03","Comércio varejista de artigos de iluminação","SIM",null,null,"47.5","47..5","7-03","-7-03","47..5-7-03","47..5-7-03"]
[null,null,null,"47.55-5","","Comércio varejista especializado de tecidos e artigos de cama, mesa e banho",null,null,null,"",".","","--",".--",""]
[null,null,null,null,"47.55-5-01","Comércio varejista de tecidos",null,null,null,{"$f":"LEFT(E1479,4)","v":"47.5"},{"$f":"CONCATENATE(LEFT(J1479,2),\".\",RIGHT(J1479,2))","v":"47..5"},{"$f":"RIGHT(E1479,4)","v":"5-01"},{"$f":"CONCATENATE(\"-\",LEFT(L1479,1),\"-\",RIGHT(L1479,2))","v":"-5-01"},{"$f":"CONCATENATE(K1479,M1479)","v":"47..5-5-01"},"47..5-5-01"]
[null,null,null,null,"47.55-5-02","Comercio varejista de artigos de armarinho",null,null,null,"47.5","47..5","5-02","-5-02","47..5-5-02","47..5-5-02"]
[null,null,null,null,"47.55-5-03","Comercio varejista de artigos de cama, mesa e banho",null,null,null,"47.5","47..5","5-03","-5-03","47..5-5-03","47..5-5-03"]
[null,null,null,"47.56-3","","Comércio varejista especializado de instrumentos musicais e acessórios",null,null,null,"",".","","--",".--",""]
[null,null,null,null,"47.56-3-00","Comércio varejista especializado de instrumentos musicais e acessórios",null,null,null,"47.5","47..5","3-00","-3-00","47..5-3-00",{"$f":"IF(LEN(N1483)=10,N1483,\"\")","v":"47..5-3-00"}]
[null,null,null,"47.57-1","","Comércio varejista especializado de peças e acessórios para aparelhos eletroeletrônicos para uso doméstico, exceto informática e comunicação",null,null,null,"",".","","--",".--",""]
[null,null,null,null,"47.57-1-00","Comércio varejista especializado de peças e acessórios para aparelhos eletroeletrônicos para uso doméstico, exceto informática e comunicação",null,null,null,"47.5","47..5","1-00","-1-00","47..5-1-00","47..5-1-00"]
[null,null,null,"47.59-8","","Comércio varejista de artigos de uso doméstico não especificados anteriormente",null,null,null,"",".","","--",".--",""]
[null,null,null,null,"47.59-8-01","Comércio varejista de artigos de tapeçaria, cortinas e persianas","SIM",null,null,"47.5","47..5","8-01","-8-01","47..5-8-01","47..5-8-01"]
[null,null,null,null,"47.59-8-99","Comércio varejista de outros artigos de uso doméstico não especificados anteriormente",null,null,null,"47.5","47..5","8-99","-8-99","47..5-8-99","47..5-8-99"]
[null,null,"47.6",null,"","Comércio varejista de artigos culturais, recreativos e esportivos",null,null,null,"",".","","--",".--",""]
[null,null,null,"47.61-0","","Comércio varejista de livros, jornais, revistas e papelaria",null,null,null,"",".","","--",".--",""]
[null,null,null,null,"47.61-0-01","Comércio varejista de livros",null,null,null,"47.6","47..6","0-01","-0-01","47..6-0-01","47..6-0-01"]
[null,null,null,null,"47.61-0-02","Comércio varejista de jornais e revistas",null,null,null,"47.6","47..6","0-02","-0-02","47..6-0-02","47..6-0-02"]
[null,null,null,null,"47.61-0-03","Comércio varejista de artigos de papelaria",null,null,null,"47.6","47..6","0-03","-0-03","47..6-0-03","47..6-0-03"]
[null,null,null,"47.62-8","","Comércio varejista de discos, CDs, DVDs e fitas",null,null,null,"",".","","--",".--",""]
[null,null,null,null,"47.62-8-00","Comércio varejista de discos, CDs, DVDs e fitas",null,null,null,"47.6","47..6","8-00","-8-00","47..6-8-00","47..6-8-00"]
[null,null,null,"47.63-6","","Comércio varejista de artigos recreativos e esportivos",null,null,null,"",".","","--",".--",""]
[null,null,null,null,"47.63-6-01","Comércio varejista de brinquedos e artigos recreativos",null,null,null,"47.6","47..6","6-01","-6-01","47..6-6-01","47..6-6-01"]
[null,null,null,null,"47.63-6-02","Comércio varejista de artigos esportivos",null,null,null,"47.6","47..6","6-02","-6-02","47..6-6-02","47..6-6-02"]
[null,null,null,null,"47.63-6-03","Comércio varejista de bicicletas e triciclos; peças e acessórios",null,null,null,"47.6","47..6","6-03","-6-03","47..6-6-03","47..6-6-03"]
[null,null,null,null,"47.63-6-04","Comércio varejista de artigos de caça, pesca e camping",null,null,null,"47.6","47..6","6-04","-6-04","47..6-6-04","47..6-6-04"]
[null,null,null,null,"47.63-6-05","Comércio varejista de embarcações e outros veículos recreativos; peças e acessórios",null,null,null,"47.6","47..6","6-05","-6-05","47..6-6-05","47..6-6-05"]
[null,null,"47.7",null,"","Comércio varejista de produtos farmacêuticos, perfumaria e cosméticos e artigos médicos, ópticos e ortopédicos",null,null,null,"",".","","--",".--",""]
[null,null,null,"47.71-7","","Comércio varejista de produtos farmacêuticos para uso humano e veterinário",null,null,null,"",".","","--",".--",""]
[null,null,null,null,"47.71-7-01","Comércio varejista de produtos farmacêuticos, sem manipulação de fórmulas",null,null,null,"47.7","47..7","7-01","-7-01","47..7-7-01","47..7-7-01"]
[null,null,null,null,"47.71-7-02","Comércio varejista de produtos farmacêuticos, com manipulação de fórmulas",null,null,null,"47.7","47..7","7-02","-7-02","47..7-7-02","47..7-7-02"]
[null,null,null,null,"47.71-7-03","Comércio varejista de produtos farmacêuticos homeopáticos",null,null,null,"47.7","47..7","7-03","-7-03","47..7-7-03","47..7-7-03"]
[null,null,null,null,"47.71-7-04","Comércio varejista de medicamentos veterinários",null,null,null,"47.7","47..7","7-04","-7-04","47..7-7-04","47..7-7-04"]
[null,null,null,"47.72-5","","Comércio varejista de cosméticos, produtos de perfumaria e de higiene pessoal",null,null,null,"",".","","--",".--",""]
[null,null,null,null,"47.72-5-00","Comércio varejista de cosméticos, produtos de perfumaria e de higiene pessoal",null,null,null,"47.7","47..7","5-00","-5-00","47..7-5-00","47..7-5-00"]
[null,null,null,"47.73-3","","Comércio varejista de artigos médicos e ortopédicos",null,null,null,"",".","","--",".--",""]
[null,null,null,null,"47.73-3-00","Comércio varejista de artigos médicos e ortopédicos",null,null,null,"47.7","47..7","3-00","-3-00","47..7-3-00","47..7-3-00"]
[null,null,null,"47.74-1","","Comércio varejista de artigos de óptica",null,null,null,"",".","","--",".--",""]
[null,null,null,null,"47.74-1-00","Comércio varejista de artigos de óptica",null,null,null,"47.7","47..7","1-00","-1-00","47..7-1-00","47..7-1-00"]
[null,null,"47.8",null,"","Comércio varejista de produtos novos não especificados anteriormente e de produtos usados",null,null,null,"",".","","--",".--",""]
[null,null,null,"47.81-4","","Comércio varejista de artigos do vestuário e acessórios",null,null,null,"",".","","--",".--",""]
[null,null,null,null,"47.81-4-00","Comércio varejista de artigos do vestuário e acessórios",null,null,null,"47.8","47..8","4-00","-4-00","47..8-4-00","47..8-4-00"]
[null,null,null,"47.82-2","","Comércio varejista de calçados e artigos de viagem",null,null,null,"",".","","--",".--",""]
[null,null,null,null,"47.82-2-01","Comércio varejista de calçados",null,null,null,"47.8","47..8","2-01","-2-01","47..8-2-01","47..8-2-01"]
[null,null,null,null,"47.82-2-02","Comércio varejista de artigos de viagem",null,null,null,"47.8","47..8","2-02","-2-02","47..8-2-02","47..8-2-02"]
[null,null,null,"47.83-1","","Comércio varejista de jóias e relógios",null,null,null,"",".","","--",".--",""]
[null,null,null,null,"47.83-1-01","Comércio varejista de artigos de joalheria",null,null,null,"47.8","47..8","1-01","-1-01","47..8-1-01","47..8-1-01"]
[null,null,null,null,"47.83-1-02","Comércio varejista de artigos de relojoaria",null,null,null,"47.8","47..8","1-02","-1-02","47..8-1-02","47..8-1-02"]
[null,null,null,"47.84-9","","Comércio varejista de gás liqüefeito de petróleo (GLP)",null,null,null,"",".","","--",".--",""]
[null,null,null,null,"47.84-9-00","Comércio varejista de gás liqüefeito de petróleo (GLP)",null,null,null,"47.8","47..8","9-00","-9-00","47..8-9-00","47..8-9-00"]
[null,null,null,"47.85-7","","Comércio varejista de artigos usados",null,null,null,"",".","","--",".--",""]
[null,null,null,null,"47.85-7-01","Comércio varejista de antiguidades",null,null,null,"47.8","47..8","7-01","-7-01","47..8-7-01","47..8-7-01"]
[null,null,null,null,"47.85-7-99","Comércio varejista de outros artigos usados",null,null,null,"47.8","47..8","7-99","-7-99","47..8-7-99","47..8-7-99"]
[null,null,null,"47.89-0","","Comércio varejista de outros produtos novos não especificados anteriormente",null,null,null,"",".","","--",".--",""]
[null,null,null,null,"47.89-0-01","Comércio varejista de suvenires, bijuterias e artesanatos",null,null,null,"47.8","47..8","0-01","-0-01","47..8-0-01","47..8-0-01"]
[null,null,null,null,"47.89-0-02","Comércio varejista de plantas e flores naturais","SIM",null,null,"47.8","47..8","0-02","-0-02","47..8-0-02","47..8-0-02"]
[null,null,null,null,"47.89-0-03","Comércio varejista de objetos de arte",null,null,null,"47.8","47..8","0-03","-0-03","47..8-0-03","47..8-0-03"]
[null,null,null,null,"47.89-0-04","Comércio varejista de animais vivos e de artigos e alimentos para animais de estimação",null,null,null,"47.8","47..8","0-04","-0-04","47..8-0-04","47..8-0-04"]
[null,null,null,null,"47.89-0-05","Comércio varejista de produtos saneantes domissanitários","SIM",null,null,"47.8","47..8","0-05","-0-05","47..8-0-05","47..8-0-05"]
[null,null,null,null,"47.89-0-06","Comércio varejista de fogos de artifício e artigos pirotécnicos",null,null,null,"47.8","47..8","0-06","-0-06","47..8-0-06","47..8-0-06"]
[null,null,null,null,"47.89-0-07","Comércio varejista de equipamentos para escritório",null,null,null,"47.8","47..8","0-07","-0-07","47..8-0-07","47..8-0-07"]
[null,null,null,null,"47.89-0-08","Comércio varejista de artigos fotográficos e para filmagem",null,null,null,"47.8","47..8","0-08","-0-08","47..8-0-08","47..8-0-08"]
[null,null,null,null,"47.89-0-09","Comércio varejista de armas e munições",null,null,null,"47.8","47..8","0-09","-0-09","47..8-0-09","47..8-0-09"]
[null,null,null,null,"47.89-0-99","Comércio varejista de outros produtos não especificados anteriormente",null,null,null,"47.8","47..8","0-99","-0-99","47..8-0-99","47..8-0-99"]
[null,null,"47.9",null,"","Comércio ambulante e outros tipos de comércio varejista",null,null,null,"",".","","--",".--",""]
[null,null,null,"47.90-3","","Comércio ambulante e outros tipos de comércio varejista",null,null,null,"",".","","--",".--",""]
["H",null,null,null,"","TRANSPORTE, ARMAZENAGEM E CORREIO",null,null,null,"",".","","--",".--",""]
[null,"49",null,null,"","TRANSPORTE TERRESTRE",null,null,null,"",".","","--",".--",""]
[null,null,"49.1",null,"","Transporte ferroviário e metroferroviário",null,null,null,{"$f":"LEFT(E1543,4)","v":""},{"$f":"CONCATENATE(LEFT(J1543,2),\".\",RIGHT(J1543,2))","v":"."},{"$f":"RIGHT(E1543,4)","v":""},{"$f":"CONCATENATE(\"-\",LEFT(L1543,1),\"-\",RIGHT(L1543,2))","v":"--"},{"$f":"CONCATENATE(K1543,M1543)","v":".--"},""]
[null,null,null,"49.11-6","","Transporte ferroviário de carga",null,null,null,"",".","","--",".--",""]
[null,null,null,null,"49.11-6-00","Transporte ferroviário de carga",null,null,null,"49.1","49..1","6-00","-6-00","49..1-6-00","49..1-6-00"]
[null,null,null,"49.12-4","","Transporte metroferroviário de passageiros",null,null,null,"",".","","--",".--",""]
[null,null,null,null,"49.12-4-01","Transporte ferroviário de passageiros intermunicipal e interestadual",null,null,null,"49.1","49..1","4-01","-4-01","49..1-4-01",{"$f":"IF(LEN(N1547)=10,N1547,\"\")","v":"49..1-4-01"}]
[null,null,null,null,"49.12-4-02","Transporte ferroviário de passageiros municipal e em região metropolitana",null,null,null,"49.1","49..1","4-02","-4-02","49..1-4-02","49..1-4-02"]
[null,null,null,null,"49.12-4-03","Transporte metroviário",null,null,null,"49.1","49..1","4-03","-4-03","49..1-4-03","49..1-4-03"]
[null,null,"49.2",null,"","Transporte rodoviário de passageiros",null,null,null,"",".","","--",".--",""]
[null,null,null,"49.21-3","","Transporte rodoviário coletivo de passageiros, com itinerário fixo, municipal e em região metropolitana",null,null,null,"",".","","--",".--",""]
[null,null,null,null,"49.21-3-01","Transporte rodoviário coletivo de passageiros, com itinerário fixo, municipal",null,null,null,"49.2","49..2","3-01","-3-01","49..2-3-01","49..2-3-01"]
[null,null,null,null,"49.21-3-02","Transporte rodoviário coletivo de passageiros, com itinerário fixo, intermunicipal em região metropolitana",null,null,null,"49.2","49..2","3-02","-3-02","49..2-3-02","49..2-3-02"]
[null,null,null,"49.22-1","","Transporte rodoviário coletivo de passageiros, com itinerário fixo, intermunicipal, interestadual e internacional",null,null,null,"",".","","--",".--",""]
[null,null,null,null,"49.22-1-01","Transporte rodoviário coletivo de passageiros, com itinerário fixo, intermunicipal, exceto em região metropolitana",null,null,null,"49.2","49..2","1-01","-1-01","49..2-1-01","49..2-1-01"]
[null,null,null,null,"49.22-1-02","Transporte rodoviário coletivo de passageiros, com itinerário fixo, interestadual",null,null,null,"49.2","49..2","1-02","-1-02","49..2-1-02","49..2-1-02"]
[null,null,null,null,"49.22-1-03","Transporte rodoviário coletivo de passageiros, com itinerário fixo, internacional",null,null,null,"49.2","49..2","1-03","-1-03","49..2-1-03","49..2-1-03"]
[null,null,null,"49.23-0","","Transporte rodoviário de táxi",null,null,null,"",".","","--",".--",""]
[null,null,null,null,"49.23-0-01","Serviço de táxi",null,null,null,"49.2","49..2","0-01","-0-01","49..2-0-01","49..2-0-01"]
[null,null,null,null,"49.23-0-02","Serviço de transporte de passageiros - locação de automóveis com motorista",null,null,null,"49.2","49..2","0-02","-0-02","49..2-0-02","49..2-0-02"]
[null,null,null,"49.24-8","","Transporte escolar",null,null,null,"",".","","--",".--",""]
[null,null,null,null,"49.24-8-00","Transporte escolar",null,null,null,"49.2","49..2","8-00","-8-00","49..2-8-00","49..2-8-00"]
[null,null,null,"49.29-9","","Transporte rodoviário coletivo de passageiros, sob regime de fretamento, e outros transportes rodoviários não especificados anteriormente",null,null,null,"",".","","--",".--",""]
[null,null,null,null,"49.29-9-01","Transporte rodoviário coletivo de passageiros, sob regime de fretamento, municipal",null,null,null,"49.2","49..2","9-01","-9-01","49..2-9-01","49..2-9-01"]
[null,null,null,null,"49.29-9-02","Transporte rodoviário coletivo de passageiros, sob regime de fretamento, intermunicipal, interestadual e internacional",null,null,null,"49.2","49..2","9-02","-9-02","49..2-9-02","49..2-9-02"]
[null,null,null,null,"49.29-9-03","Organização de excursões em veículos rodoviários próprios, municipal",null,null,null,"49.2","49..2","9-03","-9-03","49..2-9-03","49..2-9-03"]
[null,null,null,null,"49.29-9-04","Organização de excursões em veículos rodoviários próprios, intermunicipal, interestadual e internacional",null,null,null,"49.2","49..2","9-04","-9-04","49..2-9-04","49..2-9-04"]
[null,null,null,null,"49.29-9-99","Outros transportes rodoviários de passageiros não especificados anteriormente",null,null,null,"49.2","49..2","9-99","-9-99","49..2-9-99","49..2-9-99"]
[null,null,"49.3",null,"","Transporte rodoviário de carga",null,null,null,"",".","","--",".--",""]
[null,null,null,"49.30-2","","Transporte rodoviário de carga",null,null,null,"",".","","--",".--",""]
[null,null,null,null,"49.30-2-01","Transporte rodoviário de carga, exceto produtos perigosos e mudanças, municipal",null,null,null,"49.3","49..3","2-01","-2-01","49..3-2-01","49..3-2-01"]
[null,null,null,null,"49.30-2-02","Transporte rodoviário de carga, exceto produtos perigosos e mudanças, intermunicipal, interestadual e internacional",null,null,null,"49.3","49..3","2-02","-2-02","49..3-2-02","49..3-2-02"]
[null,null,null,null,"49.30-2-03","Transporte rodoviário de produtos perigosos",null,null,null,"49.3","49..3","2-03","-2-03","49..3-2-03","49..3-2-03"]
[null,null,null,null,"49.30-2-04","Transporte rodoviário de mudanças",null,null,null,"49.3","49..3","2-04","-2-04","49..3-2-04","49..3-2-04"]
[null,null,"49.4",null,"","Transporte dutoviário",null,null,null,"",".","","--",".--",""]
[null,null,null,"49.40-0","","Transporte dutoviário",null,null,null,"",".","","--",".--",""]
[null,null,null,null,"49.40-0-00","Transporte dutoviário",null,null,null,"49.4","49..4","0-00","-0-00","49..4-0-00","49..4-0-00"]
[null,null,"49.5",null,"","Trens turísticos, teleféricos e similares",null,null,null,"",".","","--",".--",""]
[null,null,null,"49.50-7","","Trens turísticos, teleféricos e similares",null,null,null,"",".","","--",".--",""]
[null,null,null,null,"49.50-7-00","Trens turísticos, teleféricos e similares",null,null,null,"49.5","49..5","7-00","-7-00","49..5-7-00","49..5-7-00"]
[null,"50",null,null,"","TRANSPORTE AQUAVIÁRIO",null,null,null,"",".","","--",".--",""]
[null,null,"50.1",null,"","Transporte marítimo de cabotagem e longo curso",null,null,null,"",".","","--",".--",""]
[null,null,null,"50.11-4","","Transporte marítimo de cabotagem",null,null,null,"",".","","--",".--",""]
[null,null,null,null,"50.11-4-01","Transporte marítimo de cabotagem - Carga",null,null,null,"50.1","50..1","4-01","-4-01","50..1-4-01","50..1-4-01"]
[null,null,null,null,"50.11-4-02","Transporte marítimo de cabotagem - Passageiros",null,null,null,"50.1","50..1","4-02","-4-02","50..1-4-02","50..1-4-02"]
[null,null,null,"50.12-2","","Transporte marítimo de longo curso",null,null,null,"",".","","--",".--",""]
[null,null,null,null,"50.12-2-01","Transporte marítimo de longo curso - Carga",null,null,null,"50.1","50..1","2-01","-2-01","50..1-2-01","50..1-2-01"]
[null,null,null,null,"50.12-2-02","Transporte marítimo de longo curso - Passageiros",null,null,null,"50.1","50..1","2-02","-2-02","50..1-2-02","50..1-2-02"]
[null,null,"50.2",null,"","Transporte por navegação interior",null,null,null,"",".","","--",".--",""]
[null,null,null,"50.21-1","","Transporte por navegação interior de carga",null,null,null,"",".","","--",".--",""]
[null,null,null,null,"50.21-1-01","Transporte por navegação interior de carga, municipal, exceto travessia",null,null,null,"50.2","50..2","1-01","-1-01","50..2-1-01","50..2-1-01"]
[null,null,null,null,"50.21-1-02","Transporte por navegação interior de carga, intermunicipal, interestadual e internacional, exceto travessia",null,null,null,"50.2","50..2","1-02","-1-02","50..2-1-02","50..2-1-02"]
[null,null,null,"50.22-0","","Transporte por navegação interior de passageiros em linhas regulares",null,null,null,"",".","","--",".--",""]
[null,null,null,null,"50.22-0-01","Transporte por navegação interior de passageiros em linhas regulares, municipal, exceto travessia",null,null,null,"50.2","50..2","0-01","-0-01","50..2-0-01","50..2-0-01"]
[null,null,null,null,"50.22-0-02","Transporte por navegação interior de passageiros em linhas regulares, intermunicipal, interestadual e internacional, exceto travessia",null,null,null,"50.2","50..2","0-02","-0-02","50..2-0-02","50..2-0-02"]
[null,null,"50.3",null,"","Navegação de apoio",null,null,null,"",".","","--",".--",""]
[null,null,null,"50.30-1","","Navegação de apoio",null,null,null,"",".","","--",".--",""]
[null,null,null,null,"50.30-1-01","Navegação de apoio marítimo",null,null,null,"50.3","50..3","1-01","-1-01","50..3-1-01","50..3-1-01"]
[null,null,null,null,"50.30-1-02","Navegação de apoio portuário",null,null,null,"50.3","50..3","1-02","-1-02","50..3-1-02","50..3-1-02"]
[null,null,null,null,"50.30-1-03","Serviço de rebocadores e empurradores",null,null,null,"50.3","50..3","1-03","-1-03","50..3-1-03","50..3-1-03"]
[null,null,"50.9",null,"","Outros transportes aquaviários",null,null,null,"",".","","--",".--",""]
[null,null,null,"50.91-2","","Transporte por navegação de travessia",null,null,null,"",".","","--",".--",""]
[null,null,null,null,"50.91-2-01","Transporte por navegação de travessia, municipal",null,null,null,"50.9","50..9","2-01","-2-01","50..9-2-01","50..9-2-01"]
[null,null,null,null,"50.91-2-02","Transporte por navegação de travessia, intermunicipal, interestadual e internacional",null,null,null,"50.9","50..9","2-02","-2-02","50..9-2-02","50..9-2-02"]
[null,null,null,"50.99-8","","Transportes aquaviários não especificados anteriormente",null,null,null,"",".","","--",".--",""]
[null,null,null,null,"50.99-8-01","Transporte aquaviário para passeios turísticos",null,null,null,"50.9","50..9","8-01","-8-01","50..9-8-01","50..9-8-01"]
[null,null,null,null,"50.99-8-99","Outros transportes aquaviários não especificados anteriormente",null,null,null,{"$f":"LEFT(E1607,4)","v":"50.9"},{"$f":"CONCATENATE(LEFT(J1607,2),\".\",RIGHT(J1607,2))","v":"50..9"},{"$f":"RIGHT(E1607,4)","v":"8-99"},{"$f":"CONCATENATE(\"-\",LEFT(L1607,1),\"-\",RIGHT(L1607,2))","v":"-8-99"},{"$f":"CONCATENATE(K1607,M1607)","v":"50..9-8-99"},"50..9-8-99"]
[null,"51",null,null,"","TRANSPORTE AÉREO",null,null,null,"",".","","--",".--",""]
[null,null,"51.1",null,"","Transporte aéreo de passageiros",null,null,null,"",".","","--",".--",""]
[null,null,null,"51.11-1","","Transporte aéreo de passageiros regular",null,null,null,"",".","","--",".--",""]
[null,null,null,null,"51.11-1-00","Transporte aéreo de passageiros regular",null,null,null,"51.1","51..1","1-00","-1-00","51..1-1-00",{"$f":"IF(LEN(N1611)=10,N1611,\"\")","v":"51..1-1-00"}]
[null,null,null,"51.12-9","","Transporte aéreo de passageiros não regular",null,null,null,"",".","","--",".--",""]
[null,null,null,null,"51.12-9-01","Serviço de táxi aéreo e locação de aeronaves com tripulação",null,null,null,"51.1","51..1","9-01","-9-01","51..1-9-01","51..1-9-01"]
[null,null,null,null,"51.12-9-99","Outros serviços de transporte aéreo de passageiros não regular",null,null,null,"51.1","51..1","9-99","-9-99","51..1-9-99","51..1-9-99"]
[null,null,"51.2",null,"","Transporte aéreo de carga",null,null,null,"",".","","--",".--",""]
[null,null,null,"51.20-0","","Transporte aéreo de carga",null,null,null,"",".","","--",".--",""]
[null,null,null,null,"51.20-0-00","Transporte aéreo de carga",null,null,null,"51.2","51..2","0-00","-0-00","51..2-0-00","51..2-0-00"]
[null,null,"51.3",null,"","Transporte espacial",null,null,null,"",".","","--",".--",""]
[null,null,null,"51.30-7","","Transporte espacial",null,null,null,"",".","","--",".--",""]
[null,null,null,null,"51.30-7-00","Transporte espacial",null,null,null,"51.3","51..3","7-00","-7-00","51..3-7-00","51..3-7-00"]
[null,"52",null,null,"","ARMAZENAMENTO E ATIVIDADES AUXILIARES DOS TRANSPORTES",null,null,null,"",".","","--",".--",""]
[null,null,"52.1",null,"","Armazenamento, carga e descarga",null,null,null,"",".","","--",".--",""]
[null,null,null,"52.11-7","","Armazenamento",null,null,null,"",".","","--",".--",""]
[null,null,null,null,"52.11-7-01","Armazéns gerais - emissão de warrant",null,null,null,"52.1","52..1","7-01","-7-01","52..1-7-01","52..1-7-01"]
[null,null,null,null,"52.11-7-02","Guarda-móveis",null,null,null,"52.1","52..1","7-02","-7-02","52..1-7-02","52..1-7-02"]
[null,null,null,null,"52.11-7-99","Depósitos de mercadorias para terceiros, exceto armazéns gerais e guarda-móveis",null,null,null,"52.1","52..1","7-99","-7-99","52..1-7-99","52..1-7-99"]
[null,null,null,"52.12-5","","Carga e descarga",null,null,null,"",".","","--",".--",""]
[null,null,null,null,"52.12-5-00","Carga e descarga",null,null,null,"52.1","52..1","5-00","-5-00","52..1-5-00","52..1-5-00"]
[null,null,"52.2",null,"","Atividades auxiliares dos transportes terrestres",null,null,null,"",".","","--",".--",""]
[null,null,null,"52.21-4","","Concessionárias de rodovias, pontes, túneis e serviços relacionados",null,null,null,"",".","","--",".--",""]
[null,null,null,null,"52.21-4-00","Concessionárias de rodovias, pontes, túneis e serviços relacionados",null,null,null,"52.2","52..2","4-00","-4-00","52..2-4-00","52..2-4-00"]
[null,null,null,"52.22-2","","Terminais rodoviários e ferroviários",null,null,null,"",".","","--",".--",""]
[null,null,null,null,"52.22-2-00","Terminais rodoviários e ferroviários",null,null,null,"52.2","52..2","2-00","-2-00","52..2-2-00","52..2-2-00"]
[null,null,null,"52.23-1","","Estacionamento de veículos",null,null,null,"",".","","--",".--",""]
[null,null,null,null,"52.23-1-00","Estacionamento de veículos",null,null,null,"52.2","52..2","1-00","-1-00","52..2-1-00","52..2-1-00"]
[null,null,null,"52.29-0","","Atividades auxiliares dos transportes terrestres não especificadas anteriormente",null,null,null,"",".","","--",".--",""]
[null,null,null,null,"52.29-0-01","Serviços de apoio ao transporte por táxi, inclusive centrais de chamada",null,null,null,"52.2","52..2","0-01","-0-01","52..2-0-01","52..2-0-01"]
[null,null,null,null,"52.29-0-02","Serviços de reboque de veículos",null,null,null,"52.2","52..2","0-02","-0-02","52..2-0-02","52..2-0-02"]
[null,null,null,null,"52.29-0-99","Outras atividades auxiliares dos transportes terrestres não especificadas anteriormente",null,null,null,"52.2","52..2","0-99","-0-99","52..2-0-99","52..2-0-99"]
[null,null,"52.3",null,"","Atividades auxiliares dos transportes aquaviários",null,null,null,"",".","","--",".--",""]
[null,null,null,"52.31-1","","Gestão de portos e terminais",null,null,null,"",".","","--",".--",""]
[null,null,null,null,"52.31-1-01","Administração da infraestrutura portuária",null,null,null,"52.3","52..3","1-01","-1-01","52..3-1-01","52..3-1-01"]
[null,null,null,null,"52.31-1-02","Atividades do Operador Portuário",null,null,null,"52.3","52..3","1-02","-1-02","52..3-1-02","52..3-1-02"]
[null,null,null,null,"52.31-1-03","Gestão de terminais aquaviários",null,null,null,"52.3","52..3","1-03","-1-03","52..3-1-03","52..3-1-03"]
[null,null,null,"52.32-0","","Atividades de agenciamento marítimo",null,null,null,"",".","","--",".--",""]
[null,null,null,null,"52.32-0-00","Atividades de agenciamento marítimo",null,null,null,"52.3","52..3","0-00","-0-00","52..3-0-00","52..3-0-00"]
[null,null,null,"52.39-7","","Atividades auxiliares dos transportes aquaviários não especificadas anteriormente",null,null,null,"",".","","--",".--",""]
[null,null,null,null,"52.39-7-01","Serviços de praticagem",null,null,null,"52.3","52..3","7-01","-7-01","52..3-7-01","52..3-7-01"]
[null,null,null,null,"52.39-7-99","Atividades auxiliares dos transportes aquaviários não especificadas anteriormente",null,null,null,"52.3","52..3","7-99","-7-99","52..3-7-99","52..3-7-99"]
[null,null,"52.4",null,"","Atividades auxiliares dos transportes aéreos",null,null,null,"",".","","--",".--",""]
[null,null,null,"52.40-1","","Atividades auxiliares dos transportes aéreos",null,null,null,"",".","","--",".--",""]
[null,null,null,null,"52.40-1-01","Operação dos aeroportos e campos de aterrissagem",null,null,null,"52.4","52..4","1-01","-1-01","52..4-1-01","52..4-1-01"]
[null,null,null,null,"52.40-1-99","Atividades auxiliares dos transportes aéreos, exceto operação dos aeroportos e campos de aterrissagem",null,null,null,"52.4","52..4","1-99","-1-99","52..4-1-99","52..4-1-99"]
[null,null,"52.5",null,"","Atividades relacionadas à organização do transporte de carga",null,null,null,"",".","","--",".--",""]
[null,null,null,"52.50-8","","Atividades relacionadas à organização do transporte de carga",null,null,null,"",".","","--",".--",""]
[null,null,null,null,"52.50-8-01","Comissaria de despachos",null,null,null,"52.5","52..5","8-01","-8-01","52..5-8-01","52..5-8-01"]
[null,null,null,null,"52.50-8-02","Atividades de despachantes aduaneiros",null,null,null,"52.5","52..5","8-02","-8-02","52..5-8-02","52..5-8-02"]
[null,null,null,null,"52.50-8-03","Agenciamento de cargas, exceto para o transporte marítimo",null,null,null,"52.5","52..5","8-03","-8-03","52..5-8-03","52..5-8-03"]
[null,null,null,null,"52.50-8-04","Organização logística do transporte de carga",null,null,null,"52.5","52..5","8-04","-8-04","52..5-8-04","52..5-8-04"]
[null,null,null,null,"52.50-8-05","Operador de transporte multimodal - OTM",null,null,null,"52.5","52..5","8-05","-8-05","52..5-8-05","52..5-8-05"]
[null,"53",null,null,"","CORREIO E OUTRAS ATIVIDADES DE ENTREGA",null,null,null,"",".","","--",".--",""]
[null,null,"53.1",null,"","Atividades de Correio",null,null,null,"",".","","--",".--",""]
[null,null,null,"53.10-5","","Atividades de Correio",null,null,null,"",".","","--",".--",""]
[null,null,null,null,"53.10-5-01","Atividades do Correio Nacional",null,null,null,"53.1","53..1","5-01","-5-01","53..1-5-01","53..1-5-01"]
[null,null,null,null,"53.10-5-02","Atividades de franqueadas e permissionárias do Correio Nacional",null,null,null,"53.1","53..1","5-02","-5-02","53..1-5-02","53..1-5-02"]
[null,null,"53.2",null,"","Atividades de malote e de entrega",null,null,null,"",".","","--",".--",""]
[null,null,null,"53.20-2","","Atividades de malote e de entrega",null,null,null,"",".","","--",".--",""]
[null,null,null,null,"53.20-2-01","Serviços de malote não realizados pelo Correio Nacional",null,null,null,"53.2","53..2","2-01","-2-01","53..2-2-01","53..2-2-01"]
[null,null,null,null,"53.20-2-02","Serviços de entrega rápida",null,null,null,"53.2","53..2","2-02","-2-02","53..2-2-02","53..2-2-02"]
["I",null,null,null,"","ALOJAMENTO E ALIMENTAÇÃO",null,null,null,"",".","","--",".--",""]
[null,"55",null,null,"","ALOJAMENTO",null,null,null,{"$f":"LEFT(E1671,4)","v":""},{"$f":"CONCATENATE(LEFT(J1671,2),\".\",RIGHT(J1671,2))","v":"."},{"$f":"RIGHT(E1671,4)","v":""},{"$f":"CONCATENATE(\"-\",LEFT(L1671,1),\"-\",RIGHT(L1671,2))","v":"--"},{"$f":"CONCATENATE(K1671,M1671)","v":".--"},""]
[null,null,"55.1",null,"","Hotéis e similares",null,null,null,"",".","","--",".--",""]
[null,null,null,"55.10-8","","Hotéis e similares",null,null,null,"",".","","--",".--",""]
[null,null,null,null,"55.10-8-01","Hotéis",null,null,null,"55.1","55..1","8-01","-8-01","55..1-8-01","55..1-8-01"]
[null,null,null,null,"55.10-8-02","Apart-hotéis",null,null,null,"55.1","55..1","8-02","-8-02","55..1-8-02",{"$f":"IF(LEN(N1675)=10,N1675,\"\")","v":"55..1-8-02"}]
[null,null,null,null,"55.10-8-03","Motéis",null,null,null,"55.1","55..1","8-03","-8-03","55..1-8-03","55..1-8-03"]
[null,null,"55.9",null,"","Outros tipos de alojamento não especificados anteriormente",null,null,null,"",".","","--",".--",""]
[null,null,null,"55.90-6","","Outros tipos de alojamento não especificados anteriormente",null,null,null,"",".","","--",".--",""]
[null,null,null,null,"55.90-6-01","Albergues, exceto assistenciais",null,null,null,"55.9","55..9","6-01","-6-01","55..9-6-01","55..9-6-01"]
[null,null,null,null,"55.90-6-02","Campings",null,null,null,"55.9","55..9","6-02","-6-02","55..9-6-02","55..9-6-02"]
[null,null,null,null,"55.90-6-03","Pensões (alojamento)",null,null,null,"55.9","55..9","6-03","-6-03","55..9-6-03","55..9-6-03"]
[null,null,null,null,"55.90-6-99","Outros alojamentos não especificados anteriormente",null,null,null,"55.9","55..9","6-99","-6-99","55..9-6-99","55..9-6-99"]
[null,"56",null,null,"","ALIMENTAÇÃO",null,null,null,"",".","","--",".--",""]
[null,null,"56.1",null,"","Restaurantes e outros serviços de alimentação e bebidas",null,null,null,"",".","","--",".--",""]
[null,null,null,"56.11-2","","Restaurantes e outros estabelecimentos de serviços de alimentação e bebidas",null,null,null,"",".","","--",".--",""]
[null,null,null,null,"56.11-2-01","Restaurantes e similares",null,null,null,"56.1","56..1","2-01","-2-01","56..1-2-01","56..1-2-01"]
[null,null,null,null,"56.11-2-03","Lanchonetes, casas de chá, de sucos e similares",null,null,null,"56.1","56..1","2-03","-2-03","56..1-2-03","56..1-2-03"]
[null,null,null,null,"56.11-2-04","Bares e outros estabelecimentos especializados em servir bebidas, sem entretenimento",null,null,null,"56.1","56..1","2-04","-2-04","56..1-2-04","56..1-2-04"]
[null,null,null,null,"56.11-2-05","Bares e outros estabelecimentos especializados em servir bebidas, com entretenimento",null,null,null,"56.1","56..1","2-05","-2-05","56..1-2-05","56..1-2-05"]
[null,null,null,"56.12-1","","Serviços ambulantes de alimentação",null,null,null,"",".","","--",".--",""]
[null,null,null,null,"56.12-1-00","Serviços ambulantes de alimentação",null,null,null,"56.1","56..1","1-00","-1-00","56..1-1-00","56..1-1-00"]
[null,null,"56.2",null,"","Serviços de catering, bufê e outros serviços de comida preparada",null,null,null,"",".","","--",".--",""]
[null,null,null,"56.20-1","","Serviços de catering, bufê e outros serviços de comida preparada",null,null,null,"",".","","--",".--",""]
[null,null,null,null,"56.20-1-01","Fornecimento de alimentos preparados preponderantemente para empresas",null,null,null,"56.2","56..2","1-01","-1-01","56..2-1-01","56..2-1-01"]
[null,null,null,null,"56.20-1-02","Serviços de alimentação para eventos e recepções - bufê",null,null,null,"56.2","56..2","1-02","-1-02","56..2-1-02","56..2-1-02"]
[null,null,null,null,"56.20-1-03","Cantinas - serviços de alimentação privativos",null,null,null,"56.2","56..2","1-03","-1-03","56..2-1-03","56..2-1-03"]
[null,null,null,null,"56.20-1-04","Fornecimento de alimentos preparados preponderantemente para consumo domiciliar",null,null,null,"56.2","56..2","1-04","-1-04","56..2-1-04","56..2-1-04"]
["J",null,null,null,"","INFORMAÇÃO E COMUNICAÇÃO",null,null,null,"",".","","--",".--",""]
[null,"58",null,null,"","EDIÇÃO E EDIÇÃO INTEGRADA À IMPRESSÃO",null,null,null,"",".","","--",".--",""]
[null,null,"58.1",null,"","Edição de livros, jornais, revistas e outras atividades de edição",null,null,null,"",".","","--",".--",""]
[null,null,null,"58.11-5","","Edição de livros",null,null,null,"",".","","--",".--",""]
[null,null,null,null,"58.11-5-00","Edição de livros",null,null,null,"58.1","58..1","5-00","-5-00","58..1-5-00","58..1-5-00"]
[null,null,null,"58.12-3","","Edição de jornais",null,null,null,"",".","","--",".--",""]
[null,null,null,null,"58.12-3-01","Edição de jornais diários",null,null,null,"58.1","58..1","3-01","-3-01","58..1-3-01","58..1-3-01"]
[null,null,null,null,"58.12-3-02","Edição de jornais não diários",null,null,null,"58.1","58..1","3-02","-3-02","58..1-3-02","58..1-3-02"]
[null,null,null,"58.13-1","","Edição de revistas",null,null,null,"",".","","--",".--",""]
[null,null,null,null,"58.13-1-00","Edição de revistas",null,null,null,"58.1","58..1","1-00","-1-00","58..1-1-00","58..1-1-00"]
[null,null,null,"58.19-1","","Edição de cadastros, listas e outros produtos gráficos",null,null,null,"",".","","--",".--",""]
[null,null,null,null,"58.19-1-00","Edição de cadastros, listas e outros produtos gráficos",null,null,null,"58.1","58..1","1-00","-1-00","58..1-1-00","58..1-1-00"]
[null,null,"58.2",null,"","Edição integrada à impressão de livros, jornais, revistas e outras publicações",null,null,null,"",".","","--",".--",""]
[null,null,null,"58.21-2","","Edição integrada à impressão de livros",null,null,null,"",".","","--",".--",""]
[null,null,null,null,"58.21-2-00","Edição integrada à impressão de livros",null,null,null,"58.2","58..2","2-00","-2-00","58..2-2-00","58..2-2-00"]
[null,null,null,"58.22-1","","Edição integrada à impressão de jornais",null,null,null,"",".","","--",".--",""]
[null,null,null,null,"58.22-1-01","Edição integrada à impressão de jornais diários",null,null,null,"58.2","58..2","1-01","-1-01","58..2-1-01","58..2-1-01"]
[null,null,null,null,"58.22-1-02","Edição integrada à impressão de jornais não diários",null,null,null,"58.2","58..2","1-02","-1-02","58..2-1-02","58..2-1-02"]
[null,null,null,"58.23-9","","Edição integrada à impressão de revistas",null,null,null,"",".","","--",".--",""]
[null,null,null,null,"58.23-9-00","Edição integrada à impressão de revistas",null,null,null,"58.2","58..2","9-00","-9-00","58..2-9-00","58..2-9-00"]
[null,null,null,"58.29-8","","Edição integrada à impressão de cadastros, listas e outros produtos gráficos",null,null,null,"",".","","--",".--",""]
[null,null,null,null,"58.29-8-00","Edição integrada à impressão de cadastros, listas e outros produtos gráficos",null,null,null,"58.2","58..2","8-00","-8-00","58..2-8-00","58..2-8-00"]
[null,"59",null,null,"","ATIVIDADES CINEMATOGRÁFICAS, PRODUÇÃO DE VÍDEOS E DE PROGRAMAS DE TELEVISÃO; GRAVAÇÃO DE SOM E EDIÇÃO DE MÚSICA",null,null,null,"",".","","--",".--",""]
[null,null,"59.1",null,"","Atividades cinematográficas, produção de vídeos e de programas de televisão",null,null,null,"",".","","--",".--",""]
[null,null,null,"59.11-1","","Atividades de produção cinematográfica, de vídeos e de programas de televisão",null,null,null,"",".","","--",".--",""]
[null,null,null,null,"59.11-1-01","Estúdios cinematográficos",null,null,null,"59.1","59..1","1-01","-1-01","59..1-1-01","59..1-1-01"]
[null,null,null,null,"59.11-1-02","Produção de filmes para publicidade",null,null,null,"59.1","59..1","1-02","-1-02","59..1-1-02","59..1-1-02"]
[null,null,null,null,"59.11-1-99","Atividades de produção cinematográfica, de vídeos e de programas de televisão não especificadas anteriormente",null,null,null,"59.1","59..1","1-99","-1-99","59..1-1-99","59..1-1-99"]
[null,null,null,"59.12-0","","Atividades de pós-produção cinematográfica, de vídeos e de programas de televisão",null,null,null,"",".","","--",".--",""]
[null,null,null,null,"59.12-0-01","Serviços de dublagem",null,null,null,"59.1","59..1","0-01","-0-01","59..1-0-01","59..1-0-01"]
[null,null,null,null,"59.12-0-02","Serviços de mixagem sonora em produção audiovisual",null,null,null,"59.1","59..1","0-02","-0-02","59..1-0-02","59..1-0-02"]
[null,null,null,null,"59.12-0-99","Atividades de pós-produção cinematográfica, de vídeos e de programas de televisão não especificadas anteriormente",null,null,null,"59.1","59..1","0-99","-0-99","59..1-0-99","59..1-0-99"]
[null,null,null,"59.13-8","","Distribuição cinematográfica, de vídeo e de programas de televisão",null,null,null,"",".","","--",".--",""]
[null,null,null,null,"59.13-8-00","Distribuição cinematográfica, de vídeo e de programas de televisão",null,null,null,"59.1","59..1","8-00","-8-00","59..1-8-00","59..1-8-00"]
[null,null,null,"59.14-6","","Atividades de exibição cinematográfica",null,null,null,"",".","","--",".--",""]
[null,null,null,null,"59.14-6-00","Atividades de exibição cinematográfica",null,null,null,"59.1","59..1","6-00","-6-00","59..1-6-00","59..1-6-00"]
[null,null,"59.2",null,"","Atividades de gravação de som e de edição de música",null,null,null,"",".","","--",".--",""]
[null,null,null,"59.20-1","","Atividades de gravação de som e de edição de música",null,null,null,{"$f":"LEFT(E1735,4)","v":""},{"$f":"CONCATENATE(LEFT(J1735,2),\".\",RIGHT(J1735,2))","v":"."},{"$f":"RIGHT(E1735,4)","v":""},{"$f":"CONCATENATE(\"-\",LEFT(L1735,1),\"-\",RIGHT(L1735,2))","v":"--"},{"$f":"CONCATENATE(K1735,M1735)","v":".--"},""]
[null,null,null,null,"59.20-1-00","Atividades de gravação de som e de edição de música",null,null,null,"59.2","59..2","1-00","-1-00","59..2-1-00","59..2-1-00"]
[null,"60",null,null,"","ATIVIDADES DE RÁDIO E DE TELEVISÃO",null,null,null,"",".","","--",".--",""]
[null,null,"60.1",null,"","Atividades de rádio",null,null,null,"",".","","--",".--",""]
[null,null,null,"60.10-1","","Atividades de rádio",null,null,null,"",".","","--",".--",{"$f":"IF(LEN(N1739)=10,N1739,\"\")","v":""}]
[null,null,null,null,"60.10-1-00","Atividades de rádio",null,null,null,"60.1","60..1","1-00","-1-00","60..1-1-00","60..1-1-00"]
[null,null,"60.2",null,"","Atividades de televisão",null,null,null,"",".","","--",".--",""]
[null,null,null,"60.21-7","","Atividades de televisão aberta",null,null,null,"",".","","--",".--",""]
[null,null,null,null,"60.21-7-00","Atividades de televisão aberta",null,null,null,"60.2","60..2","7-00","-7-00","60..2-7-00","60..2-7-00"]
[null,null,null,"60.22-5","","Programadoras e atividades relacionadas à televisão por assinatura",null,null,null,"",".","","--",".--",""]
[null,null,null,null,"60.22-5-01","Programadoras",null,null,null,"60.2","60..2","5-01","-5-01","60..2-5-01","60..2-5-01"]
[null,null,null,null,"60.22-5-02","Atividades relacionadas à televisão por assinatura, exceto programadoras",null,null,null,"60.2","60..2","5-02","-5-02","60..2-5-02","60..2-5-02"]
[null,"61",null,null,"","TELECOMUNICAÇÕES",null,null,null,"",".","","--",".--",""]
[null,null,"61.1",null,"","Telecomunicações por fio",null,null,null,"",".","","--",".--",""]
[null,null,null,"61.10-8","","Telecomunicações por fio",null,null,null,"",".","","--",".--",""]
[null,null,null,null,"61.10-8-01","Serviços de telefonia fixa comutada - STFC",null,null,null,"61.1","61..1","8-01","-8-01","61..1-8-01","61..1-8-01"]
[null,null,null,null,"61.10-8-02","Serviços de redes de transporte de telecomunicações - SRTT",null,null,null,"61.1","61..1","8-02","-8-02","61..1-8-02","61..1-8-02"]
[null,null,null,null,"61.10-8-03","Serviços de comunicação multimídia - SCM",null,null,null,"61.1","61..1","8-03","-8-03","61..1-8-03","61..1-8-03"]
[null,null,null,null,"61.10-8-99","Serviços de telecomunicações por fio não especificados anteriormente",null,null,null,"61.1","61..1","8-99","-8-99","61..1-8-99","61..1-8-99"]
[null,null,"61.2",null,"","Telecomunicações sem fio",null,null,null,"",".","","--",".--",""]
[null,null,null,"61.20-5","","Telecomunicações sem fio",null,null,null,"",".","","--",".--",""]
[null,null,null,null,"61.20-5-01","Telefonia móvel celular",null,null,null,"61.2","61..2","5-01","-5-01","61..2-5-01","61..2-5-01"]
[null,null,null,null,"61.20-5-02","Serviço móvel especializado - SME",null,null,null,"61.2","61..2","5-02","-5-02","61..2-5-02","61..2-5-02"]
[null,null,null,null,"61.20-5-99","Serviços de telecomunicações sem fio não especificados anteriormente",null,null,null,"61.2","61..2","5-99","-5-99","61..2-5-99","61..2-5-99"]
[null,null,"61.3",null,"","Telecomunicações por satélite",null,null,null,"",".","","--",".--",""]
[null,null,null,"61.30-2","","Telecomunicações por satélite",null,null,null,"",".","","--",".--",""]
[null,null,null,null,"61.30-2-00","Telecomunicações por satélite",null,null,null,"61.3","61..3","2-00","-2-00","61..3-2-00","61..3-2-00"]
[null,null,"61.4",null,"","Operadoras de televisão por assinatura",null,null,null,"",".","","--",".--",""]
[null,null,null,"61.41-8","","Operadoras de televisão por assinatura por cabo",null,null,null,"",".","","--",".--",""]
[null,null,null,null,"61.41-8-00","Operadoras de televisão por assinatura por cabo",null,null,null,"61.4","61..4","8-00","-8-00","61..4-8-00","61..4-8-00"]
[null,null,null,"61.42-6","","Operadoras de televisão por assinatura por micro-ondas",null,null,null,"",".","","--",".--",""]
[null,null,null,null,"61.42-6-00","Operadoras de televisão por assinatura por micro-ondas",null,null,null,"61.4","61..4","6-00","-6-00","61..4-6-00","61..4-6-00"]
[null,null,null,"61.43-4","","Operadoras de televisão por assinatura por satélite",null,null,null,"",".","","--",".--",""]
[null,null,null,null,"61.43-4-00","Operadoras de televisão por assinatura por satélite",null,null,null,"61.4","61..4","4-00","-4-00","61..4-4-00","61..4-4-00"]
[null,null,"61.9",null,"","Outras atividades de telecomunicações",null,null,null,"",".","","--",".--",""]
[null,null,null,"61.90-6","","Outras atividades de telecomunicações",null,null,null,"",".","","--",".--",""]
[null,null,null,null,"61.90-6-01","Provedores de acesso às redes de comunicações",null,null,null,"61.9","61..9","6-01","-6-01","61..9-6-01","61..9-6-01"]
[null,null,null,null,"61.90-6-02","Provedores de voz sobre protocolo Internet - VOIP",null,null,null,"61.9","61..9","6-02","-6-02","61..9-6-02","61..9-6-02"]
[null,null,null,null,"61.90-6-99","Outras atividades de telecomunicações não especificadas anteriormente",null,null,null,"61.9","61..9","6-99","-6-99","61..9-6-99","61..9-6-99"]
[null,"62",null,null,"","ATIVIDADES DOS SERVIÇOS DE TECNOLOGIA DA INFORMAÇÃO",null,null,null,"",".","","--",".--",""]
[null,null,"62.0",null,"","Atividades dos serviços de tecnologia da informação",null,null,null,"",".","","--",".--",""]
[null,null,null,"62.01-5","","Desenvolvimento de programas de computador sob encomenda",null,null,null,"",".","","--",".--",""]
[null,null,null,null,"62.01-5-01","Desenvolvimento de programas de computador sob encomenda",null,null,null,"62.0","62..0","5-01","-5-01","62..0-5-01","62..0-5-01"]
[null,null,null,null,"62.01-5-02","Web desing",null,null,null,"62.0","62..0","5-02","-5-02","62..0-5-02","62..0-5-02"]
[null,null,null,"62.02-3","","Desenvolvimento e licenciamento de programas de computador customizáveis",null,null,null,"",".","","--",".--",""]
[null,null,null,null,"62.02-3-00","Desenvolvimento e licenciamento de programas de computador customizáveis",null,null,null,"62.0","62..0","3-00","-3-00","62..0-3-00","62..0-3-00"]
[null,null,null,"62.03-1","","Desenvolvimento e licenciamento de programas de computador não customizáveis",null,null,null,"",".","","--",".--",""]
[null,null,null,null,"62.03-1-00","Desenvolvimento e licenciamento de programas de computador não customizáveis",null,null,null,"62.0","62..0","1-00","-1-00","62..0-1-00","62..0-1-00"]
[null,null,null,"62.04-0","","Consultoria em tecnologia da informação",null,null,null,"",".","","--",".--",""]
[null,null,null,null,"62.04-0-00","Consultoria em tecnologia da informação",null,null,null,"62.0","62..0","0-00","-0-00","62..0-0-00","62..0-0-00"]
[null,null,null,"62.09-1","","Suporte técnico, manutenção e outros serviços em tecnologia da informação",null,null,null,"",".","","--",".--",""]
[null,null,null,null,"62.09-1-00","Suporte técnico, manutenção e outros serviços em tecnologia da informação",null,null,null,"62.0","62..0","1-00","-1-00","62..0-1-00","62..0-1-00"]
[null,63,null,null,"","ATIVIDADES DE PRESTAÇÃO DE SERVIÇOS DE INFORMAÇÃO",null,null,null,"",".","","--",".--",""]
[null,null,"63.1",null,"","Tratamento de dados, hospedagem na Internet e outras atividades relacionadas",null,null,null,"",".","","--",".--",""]
[null,null,null,"63.11-9","","Tratamento de dados, provedores de serviços de aplicação e serviços de hospedagem na Internet",null,null,null,"",".","","--",".--",""]
[null,null,null,null,"63.11-9-00","Tratamento de dados, provedores de serviços de aplicação e serviços de hospedagem na Internet",null,null,null,"63.1","63..1","9-00","-9-00","63..1-9-00","63..1-9-00"]
[null,null,null,"63.19-4","","Portais, provedores de conteúdo e outros serviços de informação na Internet",null,null,null,"",".","","--",".--",""]
[null,null,null,null,"63.19-4-00","Portais, provedores de conteúdo e outros serviços de informação na Internet",null,null,null,"63.1","63..1","4-00","-4-00","63..1-4-00","63..1-4-00"]
[null,null,"63.9",null,"","Outras atividades de prestação de serviços de informação",null,null,null,"",".","","--",".--",""]
[null,null,null,"63.91-7","","Agências de notícias",null,null,null,"",".","","--",".--",""]
[null,null,null,null,"63.91-7-00","Agências de notícias",null,null,null,"63.9","63..9","7-00","-7-00","63..9-7-00","63..9-7-00"]
[null,null,null,"63.99-2","","Outras atividades de prestação de serviços de informação não especificadas anteriormente",null,null,null,"",".","","--",".--",""]
[null,null,null,null,"63.99-2-00","Outras atividades de prestação de serviços de informação não especificadas anteriormente",null,null,null,"63.9","63..9","2-00","-2-00","63..9-2-00","63..9-2-00"]
["K",null,null,null,"","ATIVIDADES FINANCEIRAS, DE SEGUROS E SERVIÇOS RELACIONADOS",null,null,null,"",".","","--",".--",""]
[null,"64",null,null,"","ATIVIDADES DE SERVIÇOS FINANCEIROS",null,null,null,{"$f":"LEFT(E1799,4)","v":""},{"$f":"CONCATENATE(LEFT(J1799,2),\".\",RIGHT(J1799,2))","v":"."},{"$f":"RIGHT(E1799,4)","v":""},{"$f":"CONCATENATE(\"-\",LEFT(L1799,1),\"-\",RIGHT(L1799,2))","v":"--"},{"$f":"CONCATENATE(K1799,M1799)","v":".--"},""]
[null,null,"64.1",null,"","Banco Central",null,null,null,"",".","","--",".--",""]
[null,null,null,"64.10-7","","Banco Central",null,null,null,"",".","","--",".--",""]
[null,null,null,null,"64.10-7-00","Banco Central",null,null,null,"64.1","64..1","7-00","-7-00","64..1-7-00","64..1-7-00"]
[null,null,"64.2",null,"","Intermediação monetária - depósitos à vista",null,null,null,"",".","","--",".--",{"$f":"IF(LEN(N1803)=10,N1803,\"\")","v":""}]
[null,null,null,"64.21-2","","Bancos comerciais",null,null,null,"",".","","--",".--",""]
[null,null,null,null,"64.21-2-00","Bancos comerciais",null,null,null,"64.2","64..2","2-00","-2-00","64..2-2-00","64..2-2-00"]
[null,null,null,"64.22-1","","Bancos múltiplos, com carteira comercial",null,null,null,"",".","","--",".--",""]
[null,null,null,null,"64.22-1-00","Bancos múltiplos, com carteira comercial",null,null,null,"64.2","64..2","1-00","-1-00","64..2-1-00","64..2-1-00"]
[null,null,null,"64.23-9","","Caixas econômicas",null,null,null,"",".","","--",".--",""]
[null,null,null,null,"64.23-9-00","Caixas econômicas",null,null,null,"64.2","64..2","9-00","-9-00","64..2-9-00","64..2-9-00"]
[null,null,null,"64.24-7","","Crédito cooperativo",null,null,null,"",".","","--",".--",""]
[null,null,null,null,"64.24-7-01","Bancos cooperativos",null,null,null,"64.2","64..2","7-01","-7-01","64..2-7-01","64..2-7-01"]
[null,null,null,null,"64.24-7-02","Cooperativas centrais de crédito",null,null,null,"64.2","64..2","7-02","-7-02","64..2-7-02","64..2-7-02"]
[null,null,null,null,"64.24-7-03","Cooperativas de crédito mútuo",null,null,null,"64.2","64..2","7-03","-7-03","64..2-7-03","64..2-7-03"]
[null,null,null,null,"64.24-7-04","Cooperativas de crédito rural",null,null,null,"64.2","64..2","7-04","-7-04","64..2-7-04","64..2-7-04"]
[null,null,"64.3",null,"","Intermediação não monetária - outros instrumentos de captação",null,null,null,"",".","","--",".--",""]
[null,null,null,"64.31-0","","Bancos múltiplos, sem carteira comercial",null,null,null,"",".","","--",".--",""]
[null,null,null,null,"64.31-0-00","Bancos múltiplos, sem carteira comercial",null,null,null,"64.3","64..3","0-00","-0-00","64..3-0-00","64..3-0-00"]
[null,null,null,"64.32-8","","Bancos de investimento",null,null,null,"",".","","--",".--",""]
[null,null,null,null,"64.32-8-00","Bancos de investimento",null,null,null,"64.3","64..3","8-00","-8-00","64..3-8-00","64..3-8-00"]
[null,null,null,"64.33-6","","Bancos de desenvolvimento",null,null,null,"",".","","--",".--",""]
[null,null,null,null,"64.33-6-00","Bancos de desenvolvimento",null,null,null,"64.3","64..3","6-00","-6-00","64..3-6-00","64..3-6-00"]
[null,null,null,"64.34-4","","Agências de fomento",null,null,null,"",".","","--",".--",""]
[null,null,null,null,"64.34-4-00","Agências de fomento",null,null,null,"64.3","64..3","4-00","-4-00","64..3-4-00","64..3-4-00"]
[null,null,null,"64.35-2","","Crédito imobiliário",null,null,null,"",".","","--",".--",""]
[null,null,null,null,"64.35-2-01","Sociedades de crédito imobiliário",null,null,null,"64.3","64..3","2-01","-2-01","64..3-2-01","64..3-2-01"]
[null,null,null,null,"64.35-2-02","Associações de poupança e empréstimo",null,null,null,"64.3","64..3","2-02","-2-02","64..3-2-02","64..3-2-02"]
[null,null,null,null,"64.35-2-03","Companhias hipotecárias",null,null,null,"64.3","64..3","2-03","-2-03","64..3-2-03","64..3-2-03"]
[null,null,null,"64.36-1","","Sociedades de crédito, financiamento e investimento - financeiras",null,null,null,"",".","","--",".--",""]
[null,null,null,null,"64.36-1-00","Sociedades de crédito, financiamento e investimento - financeiras",null,null,null,"64.3","64..3","1-00","-1-00","64..3-1-00","64..3-1-00"]
[null,null,null,"64.37-9","","Sociedades de crédito ao microempreendedor",null,null,null,"",".","","--",".--",""]
[null,null,null,null,"64.37-9-00","Sociedades de crédito ao microempreendedor",null,null,null,"64.3","64..3","9-00","-9-00","64..3-9-00","64..3-9-00"]
[null,null,null,"64.38-7","","Bancos de câmbio e outras instituições de intermediação não monetária",null,null,null,"",".","","--",".--",""]
[null,null,null,null,"64.38-7-01","Bancos de câmbio",null,null,null,"64.3","64..3","7-01","-7-01","64..3-7-01","64..3-7-01"]
[null,null,null,null,"64.38-7-99","Outras instituições de intermediação não monetária não especificadas anteriormente",null,null,null,"64.3","64..3","7-99","-7-99","64..3-7-99","64..3-7-99"]
[null,null,"64.4",null,"","Arrendamento mercantil",null,null,null,"",".","","--",".--",""]
[null,null,null,"64.40-9","","Arrendamento mercantil",null,null,null,"",".","","--",".--",""]
[null,null,null,null,"64.40-9-00","Arrendamento mercantil",null,null,null,"64.4","64..4","9-00","-9-00","64..4-9-00","64..4-9-00"]
[null,null,"64.5",null,"","Sociedades de capitalização",null,null,null,"",".","","--",".--",""]
[null,null,null,"64.50-6","","Sociedades de capitalização",null,null,null,"",".","","--",".--",""]
[null,null,null,null,"64.50-6-00","Sociedades de capitalização",null,null,null,"64.5","64..5","6-00","-6-00","64..5-6-00","64..5-6-00"]
[null,null,"64.6",null,"","Atividades de sociedades de participação",null,null,null,"",".","","--",".--",""]
[null,null,null,"64.61-1","","Holdings de instituições financeiras",null,null,null,"",".","","--",".--",""]
[null,null,null,null,"64.61-1-00","Holdings de instituições financeiras",null,null,null,"64.6","64..6","1-00","-1-00","64..6-1-00","64..6-1-00"]
[null,null,null,"64.62-0","","Holdings de instituições não financeiras",null,null,null,"",".","","--",".--",""]
[null,null,null,null,"64.62-0-00","Holdings de instituições não financeiras",null,null,null,"64.6","64..6","0-00","-0-00","64..6-0-00","64..6-0-00"]
[null,null,null,"64.63-8","","Outras sociedades de participação, exceto holdings",null,null,null,"",".","","--",".--",""]
[null,null,null,null,"64.63-8-00","Outras sociedades de participação, exceto holdings",null,null,null,"64.6","64..6","8-00","-8-00","64..6-8-00","64..6-8-00"]
[null,null,"64.7",null,"","Fundos de investimento",null,null,null,"",".","","--",".--",""]
[null,null,null,"64.70-1","","Fundos de investimento",null,null,null,"",".","","--",".--",""]
[null,null,null,null,"64.70-1-01","Fundos de investimento, exceto previdenciários e imobiliários",null,null,null,"64.7","64..7","1-01","-1-01","64..7-1-01","64..7-1-01"]
[null,null,null,null,"64.70-1-02","Fundos de investimento previdenciários",null,null,null,"64.7","64..7","1-02","-1-02","64..7-1-02","64..7-1-02"]
[null,null,null,null,"64.70-1-03","Fundos de investimento imobiliários",null,null,null,"64.7","64..7","1-03","-1-03","64..7-1-03","64..7-1-03"]
[null,null,"64.9",null,"","Atividades de serviços financeiros não especificadas anteriormente",null,null,null,"",".","","--",".--",""]
[null,null,null,"64.91-3","","Sociedades de fomento mercantil - factoring",null,null,null,"",".","","--",".--",""]
[null,null,null,null,"64.91-3-00","Sociedades de fomento mercantil - factoring",null,null,null,"64.9","64..9","3-00","-3-00","64..9-3-00","64..9-3-00"]
[null,null,null,"64.92-1","","Securitização de créditos",null,null,null,"",".","","--",".--",""]
[null,null,null,null,"64.92-1-00","Securitização de créditos",null,null,null,"64.9","64..9","1-00","-1-00","64..9-1-00","64..9-1-00"]
[null,null,null,"64.93-0","","Administração de consórcios para aquisição de bens e direitos",null,null,null,"",".","","--",".--",""]
[null,null,null,null,"64.93-0-00","Administração de consórcios para aquisição de bens e direitos",null,null,null,"64.9","64..9","0-00","-0-00","64..9-0-00","64..9-0-00"]
[null,null,null,"64.99-9","","Outras atividades de serviços financeiros não especificadas anteriormente",null,null,null,"",".","","--",".--",""]
[null,null,null,null,"64.99-9-01","Clubes de investimento",null,null,null,"64.9","64..9","9-01","-9-01","64..9-9-01","64..9-9-01"]
[null,null,null,null,"64.99-9-02","Sociedades de investimento",null,null,null,"64.9","64..9","9-02","-9-02","64..9-9-02","64..9-9-02"]
[null,null,null,null,"64.99-9-03","Fundo garantidor de crédito",null,null,null,{"$f":"LEFT(E1863,4)","v":"64.9"},{"$f":"CONCATENATE(LEFT(J1863,2),\".\",RIGHT(J1863,2))","v":"64..9"},{"$f":"RIGHT(E1863,4)","v":"9-03"},{"$f":"CONCATENATE(\"-\",LEFT(L1863,1),\"-\",RIGHT(L1863,2))","v":"-9-03"},{"$f":"CONCATENATE(K1863,M1863)","v":"64..9-9-03"},"64..9-9-03"]
[null,null,null,null,"64.99-9-04","Caixas de financiamento de corporações",null,null,null,"64.9","64..9","9-04","-9-04","64..9-9-04","64..9-9-04"]
[null,null,null,null,"64.99-9-05","Concessão de crédito pelas OSCIP",null,null,null,"64.9","64..9","9-05","-9-05","64..9-9-05","64..9-9-05"]
[null,null,null,null,"64.99-9-99","Outras atividades de serviços financeiros não especificadas anteriormente",null,null,null,"64.9","64..9","9-99","-9-99","64..9-9-99","64..9-9-99"]
[null,"65",null,null,"","SEGUROS, RESSEGUROS, PREVIDÊNCIA COMPLEMENTAR E PLANOS DE SAÚDE",null,null,null,"",".","","--",".--",{"$f":"IF(LEN(N1867)=10,N1867,\"\")","v":""}]
[null,null,"65.1",null,"","Seguros de vida e não vida",null,null,null,"",".","","--",".--",""]
[null,null,null,"65.11-1","","Seguros de vida",null,null,null,"",".","","--",".--",""]
[null,null,null,null,"65.11-1-01","Sociedade seguradora de seguros vida",null,null,null,"65.1","65..1","1-01","-1-01","65..1-1-01","65..1-1-01"]
[null,null,null,null,"65.11-1-02","Planos de auxílio-funeral",null,null,null,"65.1","65..1","1-02","-1-02","65..1-1-02","65..1-1-02"]
[null,null,null,"65.12-0","","Seguros não vida",null,null,null,"",".","","--",".--",""]
[null,null,null,null,"65.12-0-00","Sociedade seguradora de seguros não vida",null,null,null,"65.1","65..1","0-00","-0-00","65..1-0-00","65..1-0-00"]
[null,null,"65.2",null,"","Seguros-saúde",null,null,null,"",".","","--",".--",""]
[null,null,null,"65.20-1","","Seguros-saúde",null,null,null,"",".","","--",".--",""]
[null,null,null,null,"65.20-1-00","Sociedade seguradora de seguros-saúde",null,null,null,"65.2","65..2","1-00","-1-00","65..2-1-00","65..2-1-00"]
[null,null,"65.3",null,"","Resseguros",null,null,null,"",".","","--",".--",""]
[null,null,null,"65.30-8","","Resseguros",null,null,null,"",".","","--",".--",""]
[null,null,null,null,"65.30-8-00","Resseguros",null,null,null,"65.3","65..3","8-00","-8-00","65..3-8-00","65..3-8-00"]
[null,null,"65.4",null,"","Previdência complementar",null,null,null,"",".","","--",".--",""]
[null,null,null,"65.41-3","","Previdência complementar fechada",null,null,null,"",".","","--",".--",""]
[null,null,null,null,"65.41-3-00","Previdência complementar fechada",null,null,null,"65.4","65..4","3-00","-3-00","65..4-3-00","65..4-3-00"]
[null,null,null,"65.42-1","","Previdência complementar aberta",null,null,null,"",".","","--",".--",""]
[null,null,null,null,"65.42-1-00","Previdência complementar aberta",null,null,null,"65.4","65..4","1-00","-1-00","65..4-1-00","65..4-1-00"]
[null,null,"65.5",null,"","Planos de saúde",null,null,null,"",".","","--",".--",""]
[null,null,null,"65.50-2","","Planos de saúde",null,null,null,"",".","","--",".--",""]
[null,null,null,null,"65.50-2-00","Planos de saúde",null,null,null,"65.5","65..5","2-00","-2-00","65..5-2-00","65..5-2-00"]
[null,"66",null,null,"","ATIVIDADES AUXILIARES DOS SERVIÇOS FINANCEIROS, SEGUROS, PREVIDÊNCIA COMPLEMENTAR E PLANOS DE SAÚDE",null,null,null,"",".","","--",".--",""]
[null,null,"66.1",null,"","Atividades auxiliares dos serviços financeiros",null,null,null,"",".","","--",".--",""]
[null,null,null,"66.11-8","","Administração de bolsas e mercados de balcão organizados",null,null,null,"",".","","--",".--",""]
[null,null,null,null,"66.11-8-01","Bolsa de valores",null,null,null,"66.1","66..1","8-01","-8-01","66..1-8-01","66..1-8-01"]
[null,null,null,null,"66.11-8-02","Bolsa de mercadorias",null,null,null,"66.1","66..1","8-02","-8-02","66..1-8-02","66..1-8-02"]
[null,null,null,null,"66.11-8-03","Bolsa de mercadorias e futuros",null,null,null,"66.1","66..1","8-03","-8-03","66..1-8-03","66..1-8-03"]
[null,null,null,null,"66.11-8-04","Administração de mercados de balcão organizados",null,null,null,"66.1","66..1","8-04","-8-04","66..1-8-04","66..1-8-04"]
[null,null,null,"66.12-6","","Atividades de intermediários em transações de títulos, valores mobiliários e mercadorias",null,null,null,"",".","","--",".--",""]
[null,null,null,null,"66.12-6-01","Corretoras de títulos e valores mobiliários",null,null,null,"66.1","66..1","6-01","-6-01","66..1-6-01","66..1-6-01"]
[null,null,null,null,"66.12-6-02","Distribuidoras de títulos e valores mobiliários",null,null,null,"66.1","66..1","6-02","-6-02","66..1-6-02","66..1-6-02"]
[null,null,null,null,"66.12-6-03","Corretoras de câmbio",null,null,null,"66.1","66..1","6-03","-6-03","66..1-6-03","66..1-6-03"]
[null,null,null,null,"66.12-6-04","Corretoras de contratos de mercadorias",null,null,null,"66.1","66..1","6-04","-6-04","66..1-6-04","66..1-6-04"]
[null,null,null,null,"66.12-6-05","Agentes de investimentos em aplicações financeiras",null,null,null,"66.1","66..1","6-05","-6-05","66..1-6-05","66..1-6-05"]
[null,null,null,"66.13-4","","Administração de cartões de crédito",null,null,null,"",".","","--",".--",""]
[null,null,null,null,"66.13-4-00","Administração de cartões de crédito",null,null,null,"66.1","66..1","4-00","-4-00","66..1-4-00","66..1-4-00"]
[null,null,null,"66.19-3","","Atividades auxiliares dos serviços financeiros não especificadas anteriormente",null,null,null,"",".","","--",".--",""]
[null,null,null,null,"66.19-3-01","Serviços de liquidação e custódia",null,null,null,"66.1","66..1","3-01","-3-01","66..1-3-01","66..1-3-01"]
[null,null,null,null,"66.19-3-02","Correspondentes de instituições financeiras",null,null,null,"66.1","66..1","3-02","-3-02","66..1-3-02","66..1-3-02"]
[null,null,null,null,"66.19-3-03","Representações de bancos estrangeiros",null,null,null,"66.1","66..1","3-03","-3-03","66..1-3-03","66..1-3-03"]
[null,null,null,null,"66.19-3-04","Caixas eletrônicos",null,null,null,"66.1","66..1","3-04","-3-04","66..1-3-04","66..1-3-04"]
[null,null,null,null,"66.19-3-05","Operadoras de cartões de débito",null,null,null,"66.1","66..1","3-05","-3-05","66..1-3-05","66..1-3-05"]
[null,null,null,null,"66.19-3-99","Outras atividades auxiliares dos serviços financeiros não especificadas anteriormente",null,null,null,"66.1","66..1","3-99","-3-99","66..1-3-99","66..1-3-99"]
[null,null,"66.2",null,"","Atividades auxiliares dos seguros, da previdência complementar e dos planos de saúde",null,null,null,"",".","","--",".--",""]
[null,null,null,"66.21-5","","Avaliação de riscos e perdas",null,null,null,"",".","","--",".--",""]
[null,null,null,null,"66.21-5-01","Peritos e avaliadores de seguros",null,null,null,"66.2","66..2","5-01","-5-01","66..2-5-01","66..2-5-01"]
[null,null,null,null,"66.21-5-02","Auditoria e consultoria atuarial",null,null,null,"66.2","66..2","5-02","-5-02","66..2-5-02","66..2-5-02"]
[null,null,null,"66.22-3","","Corretores e agentes de seguros, de planos de previdência complementar e de saúde",null,null,null,"",".","","--",".--",""]
[null,null,null,null,"66.22-3-00","Corretores e agentes de seguros, de planos de previdência complementar e de saúde",null,null,null,"66.2","66..2","3-00","-3-00","66..2-3-00","66..2-3-00"]
[null,null,null,"66.29-1","","Atividades auxiliares dos seguros, da previdência complementar e dos planos de saúde não especificadas anteriormente",null,null,null,"",".","","--",".--",""]
[null,null,null,null,"66.29-1-00","Atividades auxiliares dos seguros, da previdência complementar e dos planos de saúde não especificadas anteriormente",null,null,null,"66.2","66..2","1-00","-1-00","66..2-1-00","66..2-1-00"]
[null,null,"66.3",null,"","Atividades de administração de fundos por contrato ou\ncomissão",null,null,null,"",".","","--",".--",""]
[null,null,null,"66.30-4","","Atividades de administração de fundos por contrato ou\ncomissão",null,null,null,"",".","","--",".--",""]
[null,null,null,null,"66.30-4-00","Atividades de administração de fundos por contrato ou comissão",null,null,null,"66.3","66..3","4-00","-4-00","66..3-4-00","66..3-4-00"]
["L",null,null,null,"","ATIVIDADES IMOBILIÁRIAS",null,null,null,"",".","","--",".--",""]
[null,"68",null,null,"","ATIVIDADES IMOBILIÁRIAS",null,null,null,"",".","","--",".--",""]
[null,null,"68.1",null,"","Atividades imobiliárias de imóveis próprios",null,null,null,"",".","","--",".--",""]
[null,null,null,"68.10-2","","Atividades imobiliárias de imóveis próprios",null,null,null,"",".","","--",".--",""]
[null,null,null,null,"68.10-2-01","Compra e venda de imóveis próprios","SIM",null,null,"68.1","68..1","2-01","-2-01","68..1-2-01","68..1-2-01"]
[null,null,null,null,"68.10-2-02","Aluguel de imóveis próprios",null,null,null,"68.1","68..1","2-02","-2-02","68..1-2-02","68..1-2-02"]
[null,null,null,null,"68.10-2-03","Loteamento de imóveis próprios",null,null,null,{"$f":"LEFT(E1927,4)","v":"68.1"},{"$f":"CONCATENATE(LEFT(J1927,2),\".\",RIGHT(J1927,2))","v":"68..1"},{"$f":"RIGHT(E1927,4)","v":"2-03"},{"$f":"CONCATENATE(\"-\",LEFT(L1927,1),\"-\",RIGHT(L1927,2))","v":"-2-03"},{"$f":"CONCATENATE(K1927,M1927)","v":"68..1-2-03"},"68..1-2-03"]
[null,null,"68.2",null,"","Atividades imobiliárias por contrato ou comissão",null,null,null,"",".","","--",".--",""]
[null,null,null,"68.21-8","","Intermediação na compra, venda e aluguel de imóveis",null,null,null,"",".","","--",".--",""]
[null,null,null,null,"68.21-8-01","Corretagem na compra e venda e avaliação de imóveis",null,null,null,"68.2","68..2","8-01","-8-01","68..2-8-01","68..2-8-01"]
[null,null,null,null,"68.21-8-02","Corretagem no aluguel de imóveis",null,null,null,"68.2","68..2","8-02","-8-02","68..2-8-02",{"$f":"IF(LEN(N1931)=10,N1931,\"\")","v":"68..2-8-02"}]
[null,null,null,"68.22-6","","Gestão e administração da propriedade imobiliária",null,null,null,"",".","","--",".--",""]
[null,null,null,null,"68.22-6-00","Gestão e administração da propriedade imobiliária",null,null,null,"68.2","68..2","6-00","-6-00","68..2-6-00","68..2-6-00"]
["M",null,null,null,"","ATIVIDADES PROFISSIONAIS, CIENTÍFICAS E TÉCNICAS",null,null,null,"",".","","--",".--",""]
[null,"69",null,null,"","ATIVIDADES JURÍDICAS, DE CONTABILIDADE E DE AUDITORIA",null,null,null,"",".","","--",".--",""]
[null,null,"69.1",null,"","Atividades jurídicas",null,null,null,"",".","","--",".--",""]
[null,null,null,"69.11-7","","Atividades jurídicas, exceto cartórios",null,null,null,"",".","","--",".--",""]
[null,null,null,null,"69.11-7-01","Serviços advocatícios",null,null,null,"69.1","69..1","7-01","-7-01","69..1-7-01","69..1-7-01"]
[null,null,null,null,"69.11-7-02","Atividades auxiliares da justiça",null,null,null,"69.1","69..1","7-02","-7-02","69..1-7-02","69..1-7-02"]
[null,null,null,null,"69.11-7-03","Agente de propriedade industrial",null,null,null,"69.1","69..1","7-03","-7-03","69..1-7-03","69..1-7-03"]
[null,null,null,"69.12-5","","Cartórios",null,null,null,"",".","","--",".--",""]
[null,null,null,null,"69.12-5-00","Cartórios",null,null,null,"69.1","69..1","5-00","-5-00","69..1-5-00","69..1-5-00"]
[null,null,"69.2",null,"","Atividades de contabilidade, consultoria e auditoria contábil e tributária",null,null,null,"",".","","--",".--",""]
[null,null,null,"69.20-6","","Atividades de contabilidade, consultoria e auditoria contábil e tributária",null,null,null,"",".","","--",".--",""]
[null,null,null,null,"69.20-6-01","Atividades de contabilidade",null,null,null,"69.2","69..2","6-01","-6-01","69..2-6-01","69..2-6-01"]
[null,null,null,null,"69.20-6-02","Atividades de consultoria e auditoria contábil e tributária",null,null,null,"69.2","69..2","6-02","-6-02","69..2-6-02","69..2-6-02"]
[null,"70",null,null,"","ATIVIDADES DE SEDES DE EMPRESAS E DE CONSULTORIA EM GESTÃO EMPRESARIAL",null,null,null,"",".","","--",".--",""]
[null,null,"70.1",null,"","Sedes de empresas e unidades administrativas locais",null,null,null,"",".","","--",".--",""]
[null,null,null,"70.10-7","","Sedes de empresas e unidades administrativas locais",null,null,null,"",".","","--",".--",""]
[null,null,"70.2",null,"","Atividades de consultoria em gestão empresarial",null,null,null,"",".","","--",".--",""]
[null,null,null,"70.20-4","","Atividades de consultoria em gestão empresarial",null,null,null,"",".","","--",".--",""]
[null,null,null,null,"70.20-4-00","Atividades de consultoria em gestão empresarial, exceto consultoria técnica específica",null,null,null,"70.2","70..2","4-00","-4-00","70..2-4-00","70..2-4-00"]
[null,"71",null,null,"","SERVIÇOS DE ARQUITETURA E ENGENHARIA; TESTES E ANÁLISES TÉCNICAS",null,null,null,"",".","","--",".--",""]
[null,null,"71.1",null,"","Serviços de arquitetura e engenharia e atividades técnicas relacionadas",null,null,null,"",".","","--",".--",""]
[null,null,null,"71.11-1","","Serviços de arquitetura",null,null,null,"",".","","--",".--",""]
[null,null,null,null,"71.11-1-00","Serviços de arquitetura","SIM","VALIDAR",null,"71.1","71..1","1-00","-1-00","71..1-1-00","71..1-1-00"]
[null,null,null,"71.12-0","","Serviços de engenharia",null,null,null,"",".","","--",".--",""]
[null,null,null,null,"71.12-0-00","Serviços de engenharia","SIM",null,null,"71.1","71..1","0-00","-0-00","71..1-0-00","71..1-0-00"]
[null,null,null,"71.19-7","","Atividades técnicas relacionadas à arquitetura e engenharia",null,null,null,"",".","","--",".--",""]
[null,null,null,null,"71.19-7-01","Serviços de cartografia, topografia e geodésia","SIM","VALIDAR",null,"71.1","71..1","7-01","-7-01","71..1-7-01","71..1-7-01"]
[null,null,null,null,"71.19-7-02","Atividades de estudos geológicos","SIM","VALIDAR",null,"71.1","71..1","7-02","-7-02","71..1-7-02","71..1-7-02"]
[null,null,null,null,"71.19-7-03","Serviços de desenho técnico relacionados à arquitetura e engenharia","SIM","VALIDAR",null,"71.1","71..1","7-03","-7-03","71..1-7-03","71..1-7-03"]
[null,null,null,null,"71.19-7-04","Serviços de perícia técnica relacionados à segurança do trabalho","SIM","VALIDAR",null,"71.1","71..1","7-04","-7-04","71..1-7-04","71..1-7-04"]
[null,null,null,null,"71.19-7-99","Atividades técnicas relacionadas à engenharia e arquitetura não especificadas anteriormente","SIM","VALIDAR",null,"71.1","71..1","7-99","-7-99","71..1-7-99","71..1-7-99"]
[null,null,"71.2",null,"","Testes e análises técnicas",null,null,null,"",".","","--",".--",""]
[null,null,null,"71.20-1","","Testes e análises técnicas",null,null,null,"",".","","--",".--",""]
[null,null,null,null,"71.20-1-00","Testes e análises técnicas",null,null,null,"71.2","71..2","1-00","-1-00","71..2-1-00","71..2-1-00"]
[null,"72",null,null,"","PESQUISA E DESENVOLVIMENTO CIENTÍFICO",null,null,null,"",".","","--",".--",""]
[null,null,"72.1",null,"","Pesquisa e desenvolvimento experimental em ciências físicas e naturais",null,null,null,"",".","","--",".--",""]
[null,null,null,"72.10-0","","Pesquisa e desenvolvimento experimental em ciências físicas e naturais",null,null,null,"",".","","--",".--",""]
[null,null,null,null,"72.10-0-00","Pesquisa e desenvolvimento experimental em ciências físicas e naturais",null,null,null,"72.1","72..1","0-00","-0-00","72..1-0-00","72..1-0-00"]
[null,null,"72.2",null,"","Pesquisa e desenvolvimento experimental em ciências sociais e humanas",null,null,null,"",".","","--",".--",""]
[null,null,null,"72.20-7","","Pesquisa e desenvolvimento experimental em ciências sociais e humanas",null,null,null,"",".","","--",".--",""]
[null,null,null,null,"72.20-7-00","Pesquisa e desenvolvimento experimental em ciências sociais e humanas",null,null,null,"72.2","72..2","7-00","-7-00","72..2-7-00","72..2-7-00"]
[null,"73",null,null,"","PUBLICIDADE E PESQUISA DE MERCADO",null,null,null,"",".","","--",".--",""]
[null,null,"73.1",null,"","Publicidade",null,null,null,"",".","","--",".--",""]
[null,null,null,"73.11-4","","Agências de publicidade",null,null,null,"",".","","--",".--",""]
[null,null,null,null,"73.11-4-00","Agências de publicidade",null,null,null,"73.1","73..1","4-00","-4-00","73..1-4-00","73..1-4-00"]
[null,null,null,"73.12-2","","Agenciamento de espaços para publicidade, exceto em veículos de comunicação",null,null,null,"",".","","--",".--",""]
[null,null,null,null,"73.12-2-00","Agenciamento de espaços para publicidade, exceto em veículos de comunicação",null,null,null,"73.1","73..1","2-00","-2-00","73..1-2-00","73..1-2-00"]
[null,null,null,"73.19-0","","Atividades de publicidade não especificadas anteriormente",null,null,null,"",".","","--",".--",""]
[null,null,null,null,"73.19-0-01","Criação de estandes para feiras e exposições",null,null,null,"73.1","73..1","0-01","-0-01","73..1-0-01","73..1-0-01"]
[null,null,null,null,"73.19-0-02","Promoção de vendas",null,null,null,"73.1","73..1","0-02","-0-02","73..1-0-02","73..1-0-02"]
[null,null,null,null,"73.19-0-03","Marketing direto",null,null,null,"73.1","73..1","0-03","-0-03","73..1-0-03","73..1-0-03"]
[null,null,null,null,"73.19-0-04","Consultoria em publicidade",null,null,null,"73.1","73..1","0-04","-0-04","73..1-0-04","73..1-0-04"]
[null,null,null,null,"73.19-0-99","Outras atividades de publicidade não especificadas anteriormente",null,null,null,"73.1","73..1","0-99","-0-99","73..1-0-99","73..1-0-99"]
[null,null,"73.2",null,"","Pesquisas de mercado e de opinião pública",null,null,null,"",".","","--",".--",""]
[null,null,null,"73.20-3","","Pesquisas de mercado e de opinião pública",null,null,null,"",".","","--",".--",""]
[null,null,null,null,"73.20-3-00","Pesquisas de mercado e de opinião pública",null,null,null,"73.2","73..2","3-00","-3-00","73..2-3-00","73..2-3-00"]
[null,"74",null,null,"","OUTRAS ATIVIDADES PROFISSIONAIS, CIENTÍFICAS E TÉCNICAS",null,null,null,"",".","","--",".--",""]
[null,null,"74.1",null,"","Design e decoração de interiores",null,null,null,{"$f":"LEFT(E1991,4)","v":""},{"$f":"CONCATENATE(LEFT(J1991,2),\".\",RIGHT(J1991,2))","v":"."},{"$f":"RIGHT(E1991,4)","v":""},{"$f":"CONCATENATE(\"-\",LEFT(L1991,1),\"-\",RIGHT(L1991,2))","v":"--"},{"$f":"CONCATENATE(K1991,M1991)","v":".--"},""]
[null,null,null,"74.10-2","","Design e decoração de interiores",null,null,null,"",".","","--",".--",""]
[null,null,null,null,"74.10-2-02","Design de interiores",null,null,null,"74.1","74..1","2-02","-2-02","74..1-2-02","74..1-2-02"]
[null,null,null,null,"74.10-2-03","Desing de produto",null,null,null,"74.1","74..1","2-03","-2-03","74..1-2-03","74..1-2-03"]
[null,null,null,null,"74.10-2-99","Atividades de desing não especificadas anteriormente",null,null,null,"74.1","74..1","2-99","-2-99","74..1-2-99",{"$f":"IF(LEN(N1995)=10,N1995,\"\")","v":"74..1-2-99"}]
[null,null,"74.2",null,"","Atividades fotográficas e similares",null,null,null,"",".","","--",".--",""]
[null,null,null,"74.20-0","","Atividades fotográficas e similares",null,null,null,"",".","","--",".--",""]
[null,null,null,null,"74.20-0-01","Atividades de produção de fotografias, exceto aérea e submarina",null,null,null,"74.2","74..2","0-01","-0-01","74..2-0-01","74..2-0-01"]
[null,null,null,null,"74.20-0-02","Atividades de produção de fotografias aéreas e submarinas",null,null,null,"74.2","74..2","0-02","-0-02","74..2-0-02","74..2-0-02"]
[null,null,null,null,"74.20-0-03","Laboratórios fotográficos",null,null,null,"74.2","74..2","0-03","-0-03","74..2-0-03","74..2-0-03"]
[null,null,null,null,"74.20-0-04","Filmagem de festas e eventos",null,null,null,"74.2","74..2","0-04","-0-04","74..2-0-04","74..2-0-04"]
[null,null,null,null,"74.20-0-05","Serviços de microfilmagem",null,null,null,"74.2","74..2","0-05","-0-05","74..2-0-05","74..2-0-05"]
[null,null,"74.9",null,"","Atividades profissionais, científicas e técnicas não especificadas anteriormente",null,null,null,"",".","","--",".--",""]
[null,null,null,"74.90-1","","Atividades profissionais, científicas e técnicas não especificadas anteriormente",null,null,null,"",".","","--",".--",""]
[null,null,null,null,"74.90-1-01","Serviços de tradução, interpretação e similares",null,null,null,"74.9","74..9","1-01","-1-01","74..9-1-01","74..9-1-01"]
[null,null,null,null,"74.90-1-02","Escafandria e mergulho",null,null,null,"74.9","74..9","1-02","-1-02","74..9-1-02","74..9-1-02"]
[null,null,null,null,"74.90-1-03","Serviços de agronomia e de consultoria às atividades agrícolas e pecuárias",null,null,null,"74.9","74..9","1-03","-1-03","74..9-1-03","74..9-1-03"]
[null,null,null,null,"74.90-1-04","Atividades de intermediação e agenciamento de serviços e negócios em geral, exceto imobiliários",null,null,null,"74.9","74..9","1-04","-1-04","74..9-1-04","74..9-1-04"]
[null,null,null,null,"74.90-1-05","Agenciamento de profissionais para atividades esportivas, culturais e artísticas",null,null,null,"74.9","74..9","1-05","-1-05","74..9-1-05","74..9-1-05"]
[null,null,null,null,"74.90-1-99","Outras atividades profissionais, científicas e técnicas não especificadas anteriormente",null,null,null,"74.9","74..9","1-99","-1-99","74..9-1-99","74..9-1-99"]
[null,"75",null,null,"","ATIVIDADES VETERINÁRIAS",null,null,null,"",".","","--",".--",""]
[null,null,"75.0",null,"","Atividades veterinárias",null,null,null,"",".","","--",".--",""]
[null,null,null,"75.00-1","","Atividades veterinárias",null,null,null,"",".","","--",".--",""]
[null,null,null,null,"75.00-1-00","Atividades veterinárias",null,null,null,"75.0","75..0","1-00","-1-00","75..0-1-00","75..0-1-00"]
["N",null,null,null,"","ATIVIDADES ADMINISTRATIVAS E SERVIÇOS COMPLEMENTARES",null,null,null,"",".","","--",".--",""]
[null,"77",null,null,"","ALUGUÉIS NÃO IMOBILIÁRIOS E GESTÃO DE ATIVOS INTANGÍVEIS NÃO FINANCEIROS",null,null,null,"",".","","--",".--",""]
[null,null,"77.1",null,"","Locação de meios de transporte sem condutor",null,null,null,"",".","","--",".--",""]
[null,null,null,"77.11-0","","Locação de automóveis sem condutor",null,null,null,"",".","","--",".--",""]
[null,null,null,null,"77.11-0-00","Locação de automóveis sem condutor",null,null,null,"77.1","77..1","0-00","-0-00","77..1-0-00","77..1-0-00"]
[null,null,null,"77.19-5","","Locação de meios de transporte, exceto automóveis, sem condutor",null,null,null,"",".","","--",".--",""]
[null,null,null,null,"77.19-5-01","Locação de embarcações sem tripulação, exceto para fins\nrecreativos",null,null,null,"77.1","77..1","5-01","-5-01","77..1-5-01","77..1-5-01"]
[null,null,null,null,"77.19-5-02","Locação de aeronaves sem tripulação",null,null,null,"77.1","77..1","5-02","-5-02","77..1-5-02","77..1-5-02"]
[null,null,null,null,"77.19-5-99","Locação de outros meios de transporte não especificados anteriormente, sem condutor",null,null,null,"77.1","77..1","5-99","-5-99","77..1-5-99","77..1-5-99"]
[null,null,"77.2",null,"","Aluguel de objetos pessoais e domésticos",null,null,null,"",".","","--",".--",""]
[null,null,null,"77.21-7","","Aluguel de equipamentos recreativos e esportivos",null,null,null,"",".","","--",".--",""]
[null,null,null,null,"77.21-7-00","Aluguel de equipamentos recreativos e esportivos",null,null,null,"77.2","77..2","7-00","-7-00","77..2-7-00","77..2-7-00"]
[null,null,null,"77.22-5","","Aluguel de fitas de vídeo, DVDs e similares",null,null,null,"",".","","--",".--",""]
[null,null,null,null,"77.22-5-00","Aluguel de fitas de vídeo, DVDs e similares",null,null,null,"77.2","77..2","5-00","-5-00","77..2-5-00","77..2-5-00"]
[null,null,null,"77.23-3","","Aluguel de objetos do vestuário, jóias e acessórios",null,null,null,"",".","","--",".--",""]
[null,null,null,null,"77.23-3-00","Aluguel de objetos do vestuário, jóias e acessórios",null,null,null,"77.2","77..2","3-00","-3-00","77..2-3-00","77..2-3-00"]
[null,null,null,"77.29-2","","Aluguel de objetos pessoais e domésticos não especificados anteriormente",null,null,null,"",".","","--",".--",""]
[null,null,null,null,"77.29-2-01","Aluguel de aparelhos de jogos eletrônicos",null,null,null,"77.2","77..2","2-01","-2-01","77..2-2-01","77..2-2-01"]
[null,null,null,null,"77.29-2-02","Aluguel de móveis, utensílios e aparelhos de uso doméstico e pessoal; instrumentos musicais",null,null,null,"77.2","77..2","2-02","-2-02","77..2-2-02","77..2-2-02"]
[null,null,null,null,"77.29-2-03","Aluguel de material médico",null,null,null,"77.2","77..2","2-03","-2-03","77..2-2-03","77..2-2-03"]
[null,null,null,null,"77.29-2-99","Aluguel de outros objetos pessoais e domésticos não especificados anteriormente",null,null,null,"77.2","77..2","2-99","-2-99","77..2-2-99","77..2-2-99"]
[null,null,"77.3",null,"","Aluguel de máquinas e equipamentos sem operador",null,null,null,"",".","","--",".--",""]
[null,null,null,"77.31-4","","Aluguel de máquinas e equipamentos agrícolas sem operador",null,null,null,"",".","","--",".--",""]
[null,null,null,null,"77.31-4-00","Aluguel de máquinas e equipamentos agrícolas sem operador",null,null,null,"77.3","77..3","4-00","-4-00","77..3-4-00","77..3-4-00"]
[null,null,null,"77.32-2","","Aluguel de máquinas e equipamentos para construção sem operador",null,null,null,"",".","","--",".--",""]
[null,null,null,null,"77.32-2-01","Aluguel de máquinas e equipamentos para construção sem operador, exceto andaimes","SIM",null,null,"77.3","77..3","2-01","-2-01","77..3-2-01","77..3-2-01"]
[null,null,null,null,"77.32-2-02","Aluguel de andaimes","SIM",null,null,"77.3","77..3","2-02","-2-02","77..3-2-02","77..3-2-02"]
[null,null,null,"77.33-1","","Aluguel de máquinas e equipamentos para escritório",null,null,null,"",".","","--",".--",""]
[null,null,null,null,"77.33-1-00","Aluguel de máquinas e equipamentos para escritório",null,null,null,"77.3","77..3","1-00","-1-00","77..3-1-00","77..3-1-00"]
[null,null,null,"77.39-0","","Aluguel de máquinas e equipamentos não especificados anteriormente",null,null,null,"",".","","--",".--",""]
[null,null,null,null,"77.39-0-01","Aluguel de máquinas e equipamentos para extração de minérios e petróleo, sem operador",null,null,null,"77.3","77..3","0-01","-0-01","77..3-0-01","77..3-0-01"]
[null,null,null,null,"77.39-0-02","Aluguel de equipamentos científicos, médicos e hospitalares, sem operador",null,null,null,"77.3","77..3","0-02","-0-02","77..3-0-02","77..3-0-02"]
[null,null,null,null,"77.39-0-03","Aluguel de palcos, coberturas e outras estruturas de uso temporário, exceto andaimes",null,null,null,"77.3","77..3","0-03","-0-03","77..3-0-03","77..3-0-03"]
[null,null,null,null,"77.39-0-99","Aluguel de outras máquinas e equipamentos comerciais e industriais não especificados anteriormente, sem operador",null,null,null,"77.3","77..3","0-99","-0-99","77..3-0-99","77..3-0-99"]
[null,null,"77.4",null,"","Gestão de ativos intangíveis não financeiros",null,null,null,"",".","","--",".--",""]
[null,null,null,"77.40-3","","Gestão de ativos intangíveis não financeiros",null,null,null,"",".","","--",".--",""]
[null,null,null,null,"77.40-3-00","Gestão de ativos intangíveis não financeiros",null,null,null,"77.4","77..4","3-00","-3-00","77..4-3-00","77..4-3-00"]
[null,"78",null,null,"","SELEÇÃO, AGENCIAMENTO E LOCAÇÃO DE MÃO DE OBRA",null,null,null,"",".","","--",".--",""]
[null,null,"78.1",null,"","Seleção e agenciamento de mão de obra",null,null,null,"",".","","--",".--",""]
[null,null,null,"78.10-8","","Seleção e agenciamento de mão de obra",null,null,null,"",".","","--",".--",""]
[null,null,null,null,"78.10-8-00","Seleção e agenciamento de mão de obra",null,null,null,{"$f":"LEFT(E2055,4)","v":"78.1"},{"$f":"CONCATENATE(LEFT(J2055,2),\".\",RIGHT(J2055,2))","v":"78..1"},{"$f":"RIGHT(E2055,4)","v":"8-00"},{"$f":"CONCATENATE(\"-\",LEFT(L2055,1),\"-\",RIGHT(L2055,2))","v":"-8-00"},{"$f":"CONCATENATE(K2055,M2055)","v":"78..1-8-00"},"78..1-8-00"]
[null,null,"78.2",null,"","Locação de mão de obra temporária",null,null,null,"",".","","--",".--",""]
[null,null,null,"78.20-5","","Locação de mão de obra temporária",null,null,null,"",".","","--",".--",""]
[null,null,null,null,"78.20-5-00","Locação de mão de obra temporária",null,null,null,"78.2","78..2","5-00","-5-00","78..2-5-00","78..2-5-00"]
[null,null,"78.3",null,"","Fornecimento e gestão de recursos humanos para terceiros",null,null,null,"",".","","--",".--",{"$f":"IF(LEN(N2059)=10,N2059,\"\")","v":""}]
[null,null,null,"78.30-2","","Fornecimento e gestão de recursos humanos para terceiros",null,null,null,"",".","","--",".--",""]
[null,null,null,null,"78.30-2-00","Fornecimento e gestão de recursos humanos para terceiros",null,null,null,"78.3","78..3","2-00","-2-00","78..3-2-00","78..3-2-00"]
[null,"79",null,null,"","AGÊNCIAS DE VIAGENS, OPERADORES TURÍSTICOS E SERVIÇOS DE RESERVAS",null,null,null,"",".","","--",".--",""]
[null,null,"79.1",null,"","Agências de viagens e operadores turísticos",null,null,null,"",".","","--",".--",""]
[null,null,null,"79.11-2","","Agências de viagens",null,null,null,"",".","","--",".--",""]
[null,null,null,null,"79.11-2-00","Agências de viagens",null,null,null,"79.1","79..1","2-00","-2-00","79..1-2-00","79..1-2-00"]
[null,null,null,"79.12-1","","Operadores turísticos",null,null,null,"",".","","--",".--",""]
[null,null,null,null,"79.12-1-00","Operadores turísticos",null,null,null,"79.1","79..1","1-00","-1-00","79..1-1-00","79..1-1-00"]
[null,null,"79.9",null,"","Serviços de reservas e outros serviços de turismo não especificados anteriormente",null,null,null,"",".","","--",".--",""]
[null,null,null,"79.90-2","","Serviços de reservas e outros serviços de turismo não especificados anteriormente",null,null,null,"",".","","--",".--",""]
[null,null,null,null,"79.90-2-00","Serviços de reservas e outros serviços de turismo não especificados anteriormente",null,null,null,"79.9","79..9","2-00","-2-00","79..9-2-00","79..9-2-00"]
[null,"80",null,null,"","ATIVIDADES DE VIGILÂNCIA, SEGURANÇA E INVESTIGAÇÃO",null,null,null,"",".","","--",".--",""]
[null,null,"80.1",null,"","Atividades de vigilância, segurança privada e transporte de valores",null,null,null,"",".","","--",".--",""]
[null,null,null,"80.11-1","","Atividades de vigilância e segurança privada",null,null,null,"",".","","--",".--",""]
[null,null,null,null,"80.11-1-01","Atividades de vigilância e segurança privada",null,null,null,"80.1","80..1","1-01","-1-01","80..1-1-01","80..1-1-01"]
[null,null,null,null,"80.11-1-02","Serviços de adestramento de cães de guarda",null,null,null,"80.1","80..1","1-02","-1-02","80..1-1-02","80..1-1-02"]
[null,null,null,"80.12-9","","Atividades de transporte de valores",null,null,null,"",".","","--",".--",""]
[null,null,null,null,"80.12-9-00","Atividades de transporte de valores",null,null,null,"80.1","80..1","9-00","-9-00","80..1-9-00","80..1-9-00"]
[null,null,"80.2",null,"","Atividades de monitoramento de sistemas de segurança",null,null,null,"",".","","--",".--",""]
[null,null,null,"80.20-0","","Atividades de monitoramento de sistemas de segurança",null,null,null,"",".","","--",".--",""]
[null,null,null,null,"80.20-0-01","Atividades de monitoramento de sistemas de segurança eletrônico",null,null,null,"80.2","80..2","0-01","-0-01","80..2-0-01","80..2-0-01"]
[null,null,null,null,"80.20-0-02","Outras atividades de serviços de segurança",null,null,null,"80.2","80..2","0-02","-0-02","80..2-0-02","80..2-0-02"]
[null,null,"80.3",null,"","Atividades de investigação particular",null,null,null,"",".","","--",".--",""]
[null,null,null,"80.30-7","","Atividades de investigação particular",null,null,null,"",".","","--",".--",""]
[null,null,null,null,"80.30-7-00","Atividades de investigação particular",null,null,null,"80.3","80..3","7-00","-7-00","80..3-7-00","80..3-7-00"]
[null,"81",null,null,"","SERVIÇOS PARA EDIFÍCIOS E ATIVIDADES PAISAGÍSTICAS",null,null,null,"",".","","--",".--",""]
[null,null,"81.1",null,"","Serviços combinados para apoio a edifícios",null,null,null,"",".","","--",".--",""]
[null,null,null,"81.11-7","","Serviços combinados para apoio a edifícios, exceto condomínios prediais",null,null,null,"",".","","--",".--",""]
[null,null,null,null,"81.11-7-00","Serviços combinados para apoio a edifícios, exceto condomínios prediais",null,null,null,"81.1","81..1","7-00","-7-00","81..1-7-00","81..1-7-00"]
[null,null,null,"81.12-5","","Condomínios prediais",null,null,null,"",".","","--",".--",""]
[null,null,null,null,"81.12-5-00","Condomínios prediais",null,null,null,"81.1","81..1","5-00","-5-00","81..1-5-00","81..1-5-00"]
[null,null,"81.2",null,"","Atividades de limpeza",null,null,null,"",".","","--",".--",""]
[null,null,null,"81.21-4","","Limpeza em prédios e em domicílios",null,null,null,"",".","","--",".--",""]
[null,null,null,null,"81.21-4-00","Limpeza em prédios e em domicílios",null,null,null,"81.2","81..2","4-00","-4-00","81..2-4-00","81..2-4-00"]
[null,null,null,"81.22-2","","Imunização e controle de pragas urbanas",null,null,null,"",".","","--",".--",""]
[null,null,null,null,"81.22-2-00","Imunização e controle de pragas urbanas",null,null,null,"81.2","81..2","2-00","-2-00","81..2-2-00","81..2-2-00"]
[null,null,null,"81.29-0","","Atividades de limpeza não especificadas anteriormente",null,null,null,"",".","","--",".--",""]
[null,null,null,null,"81.29-0-00","Atividades de limpeza não especificadas anteriormente",null,null,null,"81.2","81..2","0-00","-0-00","81..2-0-00","81..2-0-00"]
[null,null,"81.3",null,"","Atividades paisagísticas",null,null,null,"",".","","--",".--",""]
[null,null,null,"81.30-3","","Atividades paisagísticas",null,null,null,"",".","","--",".--",""]
[null,null,null,null,"81.30-3-00","Atividades paisagísticas",null,null,null,"81.3","81..3","3-00","-3-00","81..3-3-00","81..3-3-00"]
[null,"82",null,null,"","SERVIÇOS DE ESCRITÓRIO, DE APOIO ADMINISTRATIVO E OUTROS SERVIÇOS PRESTADOS PRINCIPALMENTE ÀS\nEMPRESAS",null,null,null,"",".","","--",".--",""]
[null,null,"82.1",null,"","Serviços de escritório e apoio administrativo",null,null,null,"",".","","--",".--",""]
[null,null,null,"82.11-3","","Serviços combinados de escritório e apoio administrativo",null,null,null,"",".","","--",".--",""]
[null,null,null,null,"82.11-3-00","Serviços combinados de escritório e apoio administrativo",null,null,null,"82.1","82..1","3-00","-3-00","82..1-3-00","82..1-3-00"]
[null,null,null,"82.19-9","","Fotocópias, preparação de documentos e outros serviços especializados de apoio administrativo",null,null,null,"",".","","--",".--",""]
[null,null,null,null,"82.19-9-01","Fotocópias",null,null,null,"82.1","82..1","9-01","-9-01","82..1-9-01","82..1-9-01"]
[null,null,null,null,"82.19-9-99","Preparação de documentos e serviços especializados de apoio administrativo não especificados anteriormente",null,null,null,"82.1","82..1","9-99","-9-99","82..1-9-99","82..1-9-99"]
[null,null,"82.2",null,"","Atividades de teleatendimento",null,null,null,"",".","","--",".--",""]
[null,null,null,"82.20-2","","Atividades de teleatendimento",null,null,null,"",".","","--",".--",""]
[null,null,null,null,"82.20-2-00","Atividades de teleatendimento",null,null,null,"82.2","82..2","2-00","-2-00","82..2-2-00","82..2-2-00"]
[null,null,"82.3",null,"","Atividades de organização de eventos, exceto culturais e esportivos",null,null,null,"",".","","--",".--",""]
[null,null,null,"82.30-0","","Atividades de organização de eventos, exceto culturais e esportivos",null,null,null,"",".","","--",".--",""]
[null,null,null,null,"82.30-0-01","Serviços de organização de feiras, congressos, exposições e festas",null,null,null,"82.3","82..3","0-01","-0-01","82..3-0-01","82..3-0-01"]
[null,null,null,null,"82.30-0-02","Casas de festas e eventos",null,null,null,"82.3","82..3","0-02","-0-02","82..3-0-02","82..3-0-02"]
[null,null,"82.9",null,"","Outras atividades de serviços prestados principalmente às empresas",null,null,null,"",".","","--",".--",""]
[null,null,null,"82.91-1","","Atividades de cobrança e informações cadastrais",null,null,null,"",".","","--",".--",""]
[null,null,null,null,"82.91-1-00","Atividades de cobrança e informações cadastrais",null,null,null,"82.9","82..9","1-00","-1-00","82..9-1-00","82..9-1-00"]
[null,null,null,"82.92-0","","Envasamento e empacotamento sob contrato",null,null,null,"",".","","--",".--",""]
[null,null,null,null,"82.92-0-00","Envasamento e empacotamento sob contrato",null,null,null,{"$f":"LEFT(E2119,4)","v":"82.9"},{"$f":"CONCATENATE(LEFT(J2119,2),\".\",RIGHT(J2119,2))","v":"82..9"},{"$f":"RIGHT(E2119,4)","v":"0-00"},{"$f":"CONCATENATE(\"-\",LEFT(L2119,1),\"-\",RIGHT(L2119,2))","v":"-0-00"},{"$f":"CONCATENATE(K2119,M2119)","v":"82..9-0-00"},"82..9-0-00"]
[null,null,null,"82.99-7","","Atividades de serviços prestados principalmente às empresas não especificadas anteriormente",null,null,null,"",".","","--",".--",""]
[null,null,null,null,"82.99-7-01","Medição de consumo de energia elétrica, gás e água",null,null,null,"82.9","82..9","7-01","-7-01","82..9-7-01","82..9-7-01"]
[null,null,null,null,"82.99-7-02","Emissão de vales-alimentação, vales-transporte e similares",null,null,null,"82.9","82..9","7-02","-7-02","82..9-7-02","82..9-7-02"]
[null,null,null,null,"82.99-7-03","Serviços de gravação de carimbos, exceto confecção",null,null,null,"82.9","82..9","7-03","-7-03","82..9-7-03",{"$f":"IF(LEN(N2123)=10,N2123,\"\")","v":"82..9-7-03"}]
[null,null,null,null,"82.99-7-04","Leiloeiros independentes",null,null,null,"82.9","82..9","7-04","-7-04","82..9-7-04","82..9-7-04"]
[null,null,null,null,"82.99-7-05","Serviços de levantamento de fundos sob contrato",null,null,null,"82.9","82..9","7-05","-7-05","82..9-7-05","82..9-7-05"]
[null,null,null,null,"82.99-7-06","Casas lotéricas",null,null,null,"82.9","82..9","7-06","-7-06","82..9-7-06","82..9-7-06"]
[null,null,null,null,"82.99-7-07","Salas de acesso à Internet",null,null,null,"82.9","82..9","7-07","-7-07","82..9-7-07","82..9-7-07"]
[null,null,null,null,"82.99-7-99","Outras atividades de serviços prestados principalmente às empresas não especificadas anteriormente",null,null,null,"82.9","82..9","7-99","-7-99","82..9-7-99","82..9-7-99"]
["O",null,null,null,"","ADMINISTRAÇÃO PÚBLICA, DEFESA E SEGURIDADE SOCIAL",null,null,null,"",".","","--",".--",""]
[null,"84",null,null,"","ADMINISTRAÇÃO PÚBLICA, DEFESA E SEGURIDADE SOCIAL",null,null,null,"",".","","--",".--",""]
[null,null,"84.1",null,"","Administração do estado e da política econômica e social",null,null,null,"",".","","--",".--",""]
[null,null,null,"84.11-6","","Administração pública em geral",null,null,null,"",".","","--",".--",""]
[null,null,null,null,"84.11-6-00","Administração pública em geral",null,null,null,"84.1","84..1","6-00","-6-00","84..1-6-00","84..1-6-00"]
[null,null,null,"84.12-4","","Regulação das atividades de saúde, educação, serviços culturais e outros serviços sociais",null,null,null,"",".","","--",".--",""]
[null,null,null,null,"84.12-4-00","Regulação das atividades de saúde, educação, serviços culturais e outros serviços sociais",null,null,null,"84.1","84..1","4-00","-4-00","84..1-4-00","84..1-4-00"]
[null,null,null,"84.13-2","","Regulação das atividades econômicas",null,null,null,"",".","","--",".--",""]
[null,null,null,null,"84.13-2-00","Regulação das atividades econômicas",null,null,null,"84.1","84..1","2-00","-2-00","84..1-2-00","84..1-2-00"]
[null,null,"84.2",null,"","Serviços coletivos prestados pela administração pública",null,null,null,"",".","","--",".--",""]
[null,null,null,"84.21-3","","Relações exteriores",null,null,null,"",".","","--",".--",""]
[null,null,null,null,"84.21-3-00","Relações exteriores",null,null,null,"84.2","84..2","3-00","-3-00","84..2-3-00","84..2-3-00"]
[null,null,null,"84.22-1","","Defesa",null,null,null,"",".","","--",".--",""]
[null,null,null,null,"84.22-1-00","Defesa",null,null,null,"84.2","84..2","1-00","-1-00","84..2-1-00","84..2-1-00"]
[null,null,null,"84.23-0","","Justiça",null,null,null,"",".","","--",".--",""]
[null,null,null,null,"84.23-0-00","Justiça",null,null,null,"84.2","84..2","0-00","-0-00","84..2-0-00","84..2-0-00"]
[null,null,null,"84.24-8","","Segurança e ordem pública",null,null,null,"",".","","--",".--",""]
[null,null,null,null,"84.24-8-00","Segurança e ordem pública",null,null,null,"84.2","84..2","8-00","-8-00","84..2-8-00","84..2-8-00"]
[null,null,null,"84.25-6","","Defesa Civil",null,null,null,"",".","","--",".--",""]
[null,null,null,null,"84.25-6-00","Defesa Civil",null,null,null,"84.2","84..2","6-00","-6-00","84..2-6-00","84..2-6-00"]
[null,null,"84.3",null,"","Seguridade social obrigatória",null,null,null,"",".","","--",".--",""]
[null,null,null,"84.30-2","","Seguridade social obrigatória",null,null,null,"",".","","--",".--",""]
[null,null,null,null,"84.30-2-00","Seguridade social obrigatória",null,null,null,"84.3","84..3","2-00","-2-00","84..3-2-00","84..3-2-00"]
["P",null,null,null,"","EDUCAÇÃO",null,null,null,"",".","","--",".--",""]
[null,"85",null,null,"","EDUCAÇÃO",null,null,null,"",".","","--",".--",""]
[null,null,"85.1",null,"","Educação infantil e ensino fundamental",null,null,null,"",".","","--",".--",""]
[null,null,null,"85.11-2","","Educação infantil - creche",null,null,null,"",".","","--",".--",""]
[null,null,null,null,"85.11-2-00","Educação infantil - creche",null,null,null,"85.1","85..1","2-00","-2-00","85..1-2-00","85..1-2-00"]
[null,null,null,"85.12-1","","Educação infantil - pré-escola",null,null,null,"",".","","--",".--",""]
[null,null,null,null,"85.12-1-00","Educação infantil - pré-escola",null,null,null,"85.1","85..1","1-00","-1-00","85..1-1-00","85..1-1-00"]
[null,null,null,"85.13-9","","Ensino fundamental",null,null,null,"",".","","--",".--",""]
[null,null,null,null,"85.13-9-00","Ensino fundamental",null,null,null,"85.1","85..1","9-00","-9-00","85..1-9-00","85..1-9-00"]
[null,null,"85.2",null,"","Ensino médio",null,null,null,"",".","","--",".--",""]
[null,null,null,"85.20-1","","Ensino médio",null,null,null,"",".","","--",".--",""]
[null,null,null,null,"85.20-1-00","Ensino médio",null,null,null,"85.2","85..2","1-00","-1-00","85..2-1-00","85..2-1-00"]
[null,null,"85.3",null,"","Educação superior",null,null,null,"",".","","--",".--",""]
[null,null,null,"85.31-7","","Educação superior - graduação",null,null,null,"",".","","--",".--",""]
[null,null,null,null,"85.31-7-00","Educação superior - graduação",null,null,null,"85.3","85..3","7-00","-7-00","85..3-7-00","85..3-7-00"]
[null,null,null,"85.32-5","","Educação superior - graduação e pós-graduação",null,null,null,"",".","","--",".--",""]
[null,null,null,null,"85.32-5-00","Educação superior - graduação e pós-graduação",null,null,null,"85.3","85..3","5-00","-5-00","85..3-5-00","85..3-5-00"]
[null,null,null,"85.33-3","","Educação superior - pós-graduação e extensão",null,null,null,"",".","","--",".--",""]
[null,null,null,null,"85.33-3-00","Educação superior - pós-graduação e extensão",null,null,null,"85.3","85..3","3-00","-3-00","85..3-3-00","85..3-3-00"]
[null,null,"85.4",null,"","Educação profissional de nível técnico e tecnológico",null,null,null,"",".","","--",".--",""]
[null,null,null,"85.41-4","","Educação profissional de nível técnico",null,null,null,"",".","","--",".--",""]
[null,null,null,null,"85.41-4-00","Educação profissional de nível técnico",null,null,null,"85.4","85..4","4-00","-4-00","85..4-4-00","85..4-4-00"]
[null,null,null,"85.42-2","","Educação profissional de nível tecnológico",null,null,null,"",".","","--",".--",""]
[null,null,null,null,"85.42-2-00","Educação profissional de nível tecnológico",null,null,null,"85.4","85..4","2-00","-2-00","85..4-2-00","85..4-2-00"]
[null,null,"85.5",null,"","Atividades de apoio à educação",null,null,null,"",".","","--",".--",""]
[null,null,null,"85.50-3","","Atividades de apoio à educação",null,null,null,"",".","","--",".--",""]
[null,null,null,null,"85.50-3-01","Administração de caixas escolares",null,null,null,"85.5","85..5","3-01","-3-01","85..5-3-01","85..5-3-01"]
[null,null,null,null,"85.50-3-02","Atividades de apoio à educação, exceto caixas escolares",null,null,null,"85.5","85..5","3-02","-3-02","85..5-3-02","85..5-3-02"]
[null,null,"85.9",null,"","Outras atividades de ensino",null,null,null,"",".","","--",".--",""]
[null,null,null,"85.91-1","","Ensino de esportes",null,null,null,"",".","","--",".--",""]
[null,null,null,null,"85.91-1-00","Ensino de esportes",null,null,null,"85.9","85..9","1-00","-1-00","85..9-1-00","85..9-1-00"]
[null,null,null,"85.92-9","","Ensino de arte e cultura",null,null,null,{"$f":"LEFT(E2183,4)","v":""},{"$f":"CONCATENATE(LEFT(J2183,2),\".\",RIGHT(J2183,2))","v":"."},{"$f":"RIGHT(E2183,4)","v":""},{"$f":"CONCATENATE(\"-\",LEFT(L2183,1),\"-\",RIGHT(L2183,2))","v":"--"},{"$f":"CONCATENATE(K2183,M2183)","v":".--"},""]
[null,null,null,null,"85.92-9-01","Ensino de dança",null,null,null,"85.9","85..9","9-01","-9-01","85..9-9-01","85..9-9-01"]
[null,null,null,null,"85.92-9-02","Ensino de artes cênicas, exceto dança",null,null,null,"85.9","85..9","9-02","-9-02","85..9-9-02","85..9-9-02"]
[null,null,null,null,"85.92-9-03","Ensino de música",null,null,null,"85.9","85..9","9-03","-9-03","85..9-9-03","85..9-9-03"]
[null,null,null,null,"85.92-9-99","Ensino de arte e cultura não especificado anteriormente",null,null,null,"85.9","85..9","9-99","-9-99","85..9-9-99",{"$f":"IF(LEN(N2187)=10,N2187,\"\")","v":"85..9-9-99"}]
[null,null,null,"85.93-7","","Ensino de idiomas",null,null,null,"",".","","--",".--",""]
[null,null,null,null,"85.93-7-00","Ensino de idiomas",null,null,null,"85.9","85..9","7-00","-7-00","85..9-7-00","85..9-7-00"]
[null,null,null,"85.99-6","","Atividades de ensino não especificadas anteriormente",null,null,null,"",".","","--",".--",""]
[null,null,null,null,"85.99-6-01","Formação de condutores",null,null,null,"85.9","85..9","6-01","-6-01","85..9-6-01","85..9-6-01"]
[null,null,null,null,"85.99-6-02","Cursos de pilotagem",null,null,null,"85.9","85..9","6-02","-6-02","85..9-6-02","85..9-6-02"]
[null,null,null,null,"85.99-6-03","Treinamento em informática",null,null,null,"85.9","85..9","6-03","-6-03","85..9-6-03","85..9-6-03"]
[null,null,null,null,"85.99-6-04","Treinamento em desenvolvimento profissional e gerencial",null,null,null,"85.9","85..9","6-04","-6-04","85..9-6-04","85..9-6-04"]
[null,null,null,null,"85.99-6-05","Cursos preparatórios para concursos",null,null,null,"85.9","85..9","6-05","-6-05","85..9-6-05","85..9-6-05"]
[null,null,null,null,"85.99-6-99","Outras atividades de ensino não especificadas anteriormente",null,null,null,"85.9","85..9","6-99","-6-99","85..9-6-99","85..9-6-99"]
["Q",null,null,null,"","SAÚDE HUMANA E SERVIÇOS SOCIAIS",null,null,null,"",".","","--",".--",""]
[null,"86",null,null,"","ATIVIDADES DE ATENÇÃO À SAÚDE HUMANA",null,null,null,"",".","","--",".--",""]
[null,null,"86.1",null,"","Atividades de atendimento hospitalar",null,null,null,"",".","","--",".--",""]
[null,null,null,"86.10-1","","Atividades de atendimento hospitalar",null,null,null,"",".","","--",".--",""]
[null,null,null,null,"86.10-1-01","Atividades de atendimento hospitalar, exceto pronto-socorro e unidades para atendimento a urgências",null,null,null,"86.1","86..1","1-01","-1-01","86..1-1-01","86..1-1-01"]
[null,null,null,null,"86.10-1-02","Atividades de atendimento em pronto-socorro e unidades hospitalares para atendimento a urgências",null,null,null,"86.1","86..1","1-02","-1-02","86..1-1-02","86..1-1-02"]
[null,null,"86.2",null,"","Serviços móveis de atendimento a urgências e de remoção de pacientes",null,null,null,"",".","","--",".--",""]
[null,null,null,"86.21-6","","Serviços móveis de atendimento a urgências",null,null,null,"",".","","--",".--",""]
[null,null,null,null,"86.21-6-01","UTI móvel",null,null,null,"86.2","86..2","6-01","-6-01","86..2-6-01","86..2-6-01"]
[null,null,null,null,"86.21-6-02","Serviços móveis de atendimento a urgências, exceto por UTI móvel",null,null,null,"86.2","86..2","6-02","-6-02","86..2-6-02","86..2-6-02"]
[null,null,null,"86.22-4","","Serviços de remoção de pacientes, exceto os serviços móveis de atendimento a urgências",null,null,null,"",".","","--",".--",""]
[null,null,null,null,"86.22-4-00","Serviços de remoção de pacientes, exceto os serviços móveis de atendimento a urgências",null,null,null,"86.2","86..2","4-00","-4-00","86..2-4-00","86..2-4-00"]
[null,null,"86.3",null,"","Atividades de atenção ambulatorial executadas por médicos e odontólogos",null,null,null,"",".","","--",".--",""]
[null,null,null,"86.30-5","","Atividades de atenção ambulatorial executadas por médicos e odontólogos",null,null,null,"",".","","--",".--",""]
[null,null,null,null,"86.30-5-01","Atividade médica ambulatorial com recursos para realização de procedimentos cirúrgicos",null,null,null,"86.3","86..3","5-01","-5-01","86..3-5-01","86..3-5-01"]
[null,null,null,null,"86.30-5-02","Atividade médica ambulatorial com recursos para realização de exames complementares",null,null,null,"86.3","86..3","5-02","-5-02","86..3-5-02","86..3-5-02"]
[null,null,null,null,"86.30-5-03","Atividade médica ambulatorial restrita a consultas",null,null,null,"86.3","86..3","5-03","-5-03","86..3-5-03","86..3-5-03"]
[null,null,null,null,"86.30-5-04","Atividade odontológica",null,null,null,"86.3","86..3","5-04","-5-04","86..3-5-04","86..3-5-04"]
[null,null,null,null,"86.30-5-06","Serviços de vacinação e imunização humana",null,null,null,"86.3","86..3","5-06","-5-06","86..3-5-06","86..3-5-06"]
[null,null,null,null,"86.30-5-07","Atividades de reprodução humana assistida",null,null,null,"86.3","86..3","5-07","-5-07","86..3-5-07","86..3-5-07"]
[null,null,null,null,"86.30-5-99","Atividades de atenção ambulatorial não especificadas anteriormente",null,null,null,"86.3","86..3","5-99","-5-99","86..3-5-99","86..3-5-99"]
[null,null,"86.4",null,"","Atividades de serviços de complementação diagnóstica e terapêutica",null,null,null,"",".","","--",".--",""]
[null,null,null,"86.40-2","","Atividades de serviços de complementação diagnóstica e terapêutica",null,null,null,"",".","","--",".--",""]
[null,null,null,null,"86.40-2-01","Laboratórios de anatomia patológica e citológica",null,null,null,"86.4","86..4","2-01","-2-01","86..4-2-01","86..4-2-01"]
[null,null,null,null,"86.40-2-02","Laboratórios clínicos",null,null,null,"86.4","86..4","2-02","-2-02","86..4-2-02","86..4-2-02"]
[null,null,null,null,"86.40-2-03","Serviços de diálise e nefrologia",null,null,null,"86.4","86..4","2-03","-2-03","86..4-2-03","86..4-2-03"]
[null,null,null,null,"86.40-2-04","Serviços de tomografia",null,null,null,"86.4","86..4","2-04","-2-04","86..4-2-04","86..4-2-04"]
[null,null,null,null,"86.40-2-05","Serviços de diagnóstico por imagem com uso de radiação ionizante, exceto tomografia",null,null,null,"86.4","86..4","2-05","-2-05","86..4-2-05","86..4-2-05"]
[null,null,null,null,"86.40-2-06","Serviços de ressonância magnética",null,null,null,"86.4","86..4","2-06","-2-06","86..4-2-06","86..4-2-06"]
[null,null,null,null,"86.40-2-07","Serviços de diagnóstico por imagem sem uso de radiação ionizante, exceto ressonância magnética",null,null,null,"86.4","86..4","2-07","-2-07","86..4-2-07","86..4-2-07"]
[null,null,null,null,"86.40-2-08","Serviços de diagnóstico por registro gráfico - ECG, EEG e outros exames análogos",null,null,null,"86.4","86..4","2-08","-2-08","86..4-2-08","86..4-2-08"]
[null,null,null,null,"86.40-2-09","Serviços de diagnóstico por métodos ópticos - endoscopia e outros exames análogos",null,null,null,"86.4","86..4","2-09","-2-09","86..4-2-09","86..4-2-09"]
[null,null,null,null,"86.40-2-10","Serviços de quimioterapia",null,null,null,"86.4","86..4","2-10","-2-10","86..4-2-10","86..4-2-10"]
[null,null,null,null,"86.40-2-11","Serviços de radioterapia",null,null,null,"86.4","86..4","2-11","-2-11","86..4-2-11","86..4-2-11"]
[null,null,null,null,"86.40-2-12","Serviços de hemoterapia",null,null,null,"86.4","86..4","2-12","-2-12","86..4-2-12","86..4-2-12"]
[null,null,null,null,"86.40-2-13","Serviços de litotripsia",null,null,null,"86.4","86..4","2-13","-2-13","86..4-2-13","86..4-2-13"]
[null,null,null,null,"86.40-2-14","Serviços de bancos de células e tecidos humanos",null,null,null,"86.4","86..4","2-14","-2-14","86..4-2-14","86..4-2-14"]
[null,null,null,null,"86.40-2-99","Atividades de serviços de complementação diagnóstica e terapêutica não especificadas anteriormente",null,null,null,"86.4","86..4","2-99","-2-99","86..4-2-99","86..4-2-99"]
[null,null,"86.5",null,"","Atividades de profissionais da área de saúde, exceto médicos e odontólogos",null,null,null,"",".","","--",".--",""]
[null,null,null,"86.50-0","","Atividades de profissionais da área de saúde, exceto médicos e odontólogos",null,null,null,"",".","","--",".--",""]
[null,null,null,null,"86.50-0-01","Atividades de enfermagem",null,null,null,"86.5","86..5","0-01","-0-01","86..5-0-01","86..5-0-01"]
[null,null,null,null,"86.50-0-02","Atividades de profissionais da nutrição",null,null,null,"86.5","86..5","0-02","-0-02","86..5-0-02","86..5-0-02"]
[null,null,null,null,"86.50-0-03","Atividades de psicologia e psicanálise",null,null,null,"86.5","86..5","0-03","-0-03","86..5-0-03","86..5-0-03"]
[null,null,null,null,"86.50-0-04","Atividades de fisioterapia",null,null,null,"86.5","86..5","0-04","-0-04","86..5-0-04","86..5-0-04"]
[null,null,null,null,"86.50-0-05","Atividades de terapia ocupacional",null,null,null,"86.5","86..5","0-05","-0-05","86..5-0-05","86..5-0-05"]
[null,null,null,null,"86.50-0-06","Atividades de fonoaudiologia",null,null,null,"86.5","86..5","0-06","-0-06","86..5-0-06","86..5-0-06"]
[null,null,null,null,"86.50-0-07","Atividades de terapia de nutrição enteral e parenteral",null,null,null,"86.5","86..5","0-07","-0-07","86..5-0-07","86..5-0-07"]
[null,null,null,null,"86.50-0-99","Atividades de profissionais da área de saúde não especificadas anteriormente",null,null,null,"86.5","86..5","0-99","-0-99","86..5-0-99","86..5-0-99"]
[null,null,"86.6",null,"","Atividades de apoio à gestão de saúde",null,null,null,"",".","","--",".--",""]
[null,null,null,"86.60-7","","Atividades de apoio à gestão de saúde",null,null,null,"",".","","--",".--",""]
[null,null,null,null,"86.60-7-00","Atividades de apoio à gestão de saúde",null,null,null,{"$f":"LEFT(E2247,4)","v":"86.6"},{"$f":"CONCATENATE(LEFT(J2247,2),\".\",RIGHT(J2247,2))","v":"86..6"},{"$f":"RIGHT(E2247,4)","v":"7-00"},{"$f":"CONCATENATE(\"-\",LEFT(L2247,1),\"-\",RIGHT(L2247,2))","v":"-7-00"},{"$f":"CONCATENATE(K2247,M2247)","v":"86..6-7-00"},"86..6-7-00"]
[null,null,"86.9",null,"","Atividades de atenção à saúde humana não especificadas anteriormente",null,null,null,"",".","","--",".--",""]
[null,null,null,"86.90-9","","Atividades de atenção à saúde humana não especificadas anteriormente",null,null,null,"",".","","--",".--",""]
[null,null,null,null,"86.90-9-01","Atividades de práticas integrativas e complementares em saúde humana",null,null,null,"86.9","86..9","9-01","-9-01","86..9-9-01","86..9-9-01"]
[null,null,null,null,"86.90-9-02","Atividades de bancos de leite humano",null,null,null,"86.9","86..9","9-02","-9-02","86..9-9-02",{"$f":"IF(LEN(N2251)=10,N2251,\"\")","v":"86..9-9-02"}]
[null,null,null,null,"86.90-9-03","Atividades de acupuntura",null,null,null,"86.9","86..9","9-03","-9-03","86..9-9-03","86..9-9-03"]
[null,null,null,null,"86.90-9-04","Atividades de podologia",null,null,null,"86.9","86..9","9-04","-9-04","86..9-9-04","86..9-9-04"]
[null,null,null,null,"86.90-9-99","Outras atividades de atenção à saúde humana não especificadas anteriormente",null,null,null,"86.9","86..9","9-99","-9-99","86..9-9-99","86..9-9-99"]
[null,"87",null,null,"","ATIVIDADES DE ATENÇÃO À SAÚDE HUMANA INTEGRADAS COM ASSISTÊNCIA SOCIAL, PRESTADAS EM RESIDÊNCIAS COLETIVAS E PARTICULARES",null,null,null,"",".","","--",".--",""]
[null,null,"87.1",null,"","Atividades de assistência a idosos, deficientes físicos, imunodeprimidos e convalescentes, e de infraestrutura e apoio a pacientes prestadas em residências coletivas e particulares",null,null,null,"",".","","--",".--",""]
[null,null,null,"87.11-5","","Atividades de assistência a idosos, deficientes físicos, imunodeprimidos e convalescentes prestadas em residências coletivas e particulares",null,null,null,"",".","","--",".--",""]
[null,null,null,null,"87.11-5-01","Clínicas e residências geriátricas",null,null,null,"87.1","87..1","5-01","-5-01","87..1-5-01","87..1-5-01"]
[null,null,null,null,"87.11-5-02","Instituições de longa permanência para idosos",null,null,null,"87.1","87..1","5-02","-5-02","87..1-5-02","87..1-5-02"]
[null,null,null,null,"87.11-5-03","Atividades de assistência a deficientes físicos, imunodeprimidos e convalescentes",null,null,null,"87.1","87..1","5-03","-5-03","87..1-5-03","87..1-5-03"]
[null,null,null,null,"87.11-5-04","Centros de apoio a pacientes com câncer e com AIDS",null,null,null,"87.1","87..1","5-04","-5-04","87..1-5-04","87..1-5-04"]
[null,null,null,null,"87.11-5-05","Condomínios residenciais para idosos",null,null,null,"87.1","87..1","5-05","-5-05","87..1-5-05","87..1-5-05"]
[null,null,null,"87.12-3","","Atividades de fornecimento de infraestrutura de apoio e assistência a paciente no domicílio",null,null,null,"",".","","--",".--",""]
[null,null,null,null,"87.12-3-00","Atividades de fornecimento de infraestrutura de apoio e assistência a paciente no domicílio",null,null,null,"87.1","87..1","3-00","-3-00","87..1-3-00","87..1-3-00"]
[null,null,"87.2",null,"","Atividades de assistência psicossocial e à saúde a portadores de distúrbios psíquicos, deficiência mental e dependência\nquímica",null,null,null,"",".","","--",".--",""]
[null,null,null,"87.20-4","","Atividades de assistência psicossocial e à saúde a portadores de distúrbios psíquicos, deficiência mental e dependência\nquímica",null,null,null,"",".","","--",".--",""]
[null,null,null,null,"87.20-4-01","Atividades de centros de assistência psicossocial",null,null,null,"87.2","87..2","4-01","-4-01","87..2-4-01","87..2-4-01"]
[null,null,null,null,"87.20-4-99","Atividades de assistência psicossocial e à saúde a portadores de distúrbios psíquicos, deficiência mental e dependência química e grupos similares não especificadas anteriormente",null,null,null,"87.2","87..2","4-99","-4-99","87..2-4-99","87..2-4-99"]
[null,null,"87.3",null,"","Atividades de assistência social prestadas em residências coletivas e particulares",null,null,null,"",".","","--",".--",""]
[null,null,null,"87.30-1","","Atividades de assistência social prestadas em residências coletivas e particulares",null,null,null,"",".","","--",".--",""]
[null,null,null,null,"87.30-1-01","Orfanatos",null,null,null,"87.3","87..3","1-01","-1-01","87..3-1-01","87..3-1-01"]
[null,null,null,null,"87.30-1-02","Albergues assistenciais",null,null,null,"87.3","87..3","1-02","-1-02","87..3-1-02","87..3-1-02"]
[null,null,null,null,"87.30-1-99","Atividades de assistência social prestadas em residências coletivas e particulares não especificadas anteriormente",null,null,null,"87.3","87..3","1-99","-1-99","87..3-1-99","87..3-1-99"]
[null,"88",null,null,"","SERVIÇOS DE ASSISTÊNCIA SOCIAL SEM ALOJAMENTO",null,null,null,"",".","","--",".--",""]
[null,null,"88.0",null,"","Serviços de assistência social sem alojamento",null,null,null,"",".","","--",".--",""]
[null,null,null,"88.00-6","","Serviços de assistência social sem alojamento",null,null,null,"",".","","--",".--",""]
[null,null,null,null,"88.00-6-00","Serviços de assistência social sem alojamento",null,null,null,"88.0","88..0","6-00","-6-00","88..0-6-00","88..0-6-00"]
["R",null,null,null,"","ARTES, CULTURA, ESPORTE E RECREAÇÃO",null,null,null,"",".","","--",".--",""]
[null,"90",null,null,"","ATIVIDADES ARTÍSTICAS, CRIATIVAS E DE ESPETÁCULOS",null,null,null,"",".","","--",".--",""]
[null,null,"90.0",null,"","Atividades artísticas, criativas e de espetáculos",null,null,null,"",".","","--",".--",""]
[null,null,null,"90.01-9","","Artes cênicas, espetáculos e atividades complementares",null,null,null,"",".","","--",".--",""]
[null,null,null,null,"90.01-9-01","Produção teatral",null,null,null,"90.0","90..0","9-01","-9-01","90..0-9-01","90..0-9-01"]
[null,null,null,null,"90.01-9-02","Produção musical",null,null,null,"90.0","90..0","9-02","-9-02","90..0-9-02","90..0-9-02"]
[null,null,null,null,"90.01-9-03","Produção de espetáculos de dança",null,null,null,"90.0","90..0","9-03","-9-03","90..0-9-03","90..0-9-03"]
[null,null,null,null,"90.01-9-04","Produção de espetáculos circenses, de marionetes e similares",null,null,null,"90.0","90..0","9-04","-9-04","90..0-9-04","90..0-9-04"]
[null,null,null,null,"90.01-9-05","Produção de espetáculos de rodeios, vaquejadas e similares",null,null,null,"90.0","90..0","9-05","-9-05","90..0-9-05","90..0-9-05"]
[null,null,null,null,"90.01-9-06","Atividades de sonorização e de iluminação",null,null,null,"90.0","90..0","9-06","-9-06","90..0-9-06","90..0-9-06"]
[null,null,null,null,"90.01-9-99","Artes cênicas, espetáculos e atividades complementares não especificados anteriormente",null,null,null,"90.0","90..0","9-99","-9-99","90..0-9-99","90..0-9-99"]
[null,null,null,"90.02-7","","Criação artística",null,null,null,"",".","","--",".--",""]
[null,null,null,null,"90.02-7-01","Atividades de artistas plásticos, jornalistas independentes e\nescritores",null,null,null,"90.0","90..0","7-01","-7-01","90..0-7-01","90..0-7-01"]
[null,null,null,null,"90.02-7-02","Restauração de obras de arte",null,null,null,"90.0","90..0","7-02","-7-02","90..0-7-02","90..0-7-02"]
[null,null,null,"90.03-5","","Gestão de espaços para artes cênicas, espetáculos e outras atividades artísticas",null,null,null,"",".","","--",".--",""]
[null,null,null,null,"90.03-5-00","Gestão de espaços para artes cênicas, espetáculos e outras atividades artísticas",null,null,null,"90.0","90..0","5-00","-5-00","90..0-5-00","90..0-5-00"]
[null,"91",null,null,"","ATIVIDADES LIGADAS AO PATRIMÔNIO CULTURAL E AMBIENTAL",null,null,null,"",".","","--",".--",""]
[null,null,"91.0",null,"","Atividades ligadas ao patrimônio cultural e ambiental",null,null,null,"",".","","--",".--",""]
[null,null,null,"91.01-5","","Atividades de bibliotecas e arquivos",null,null,null,"",".","","--",".--",""]
[null,null,null,null,"91.01-5-00","Atividades de bibliotecas e arquivos",null,null,null,"91.0","91..0","5-00","-5-00","91..0-5-00","91..0-5-00"]
[null,null,null,"91.02-3","","Atividades de museus e de exploração, restauração artística\ne conservação de lugares e prédios históricos e atrações\nsimilares",null,null,null,"",".","","--",".--",""]
[null,null,null,null,"91.02-3-01","Atividades de museus e de exploração de lugares e prédios históricos e atrações similares",null,null,null,"91.0","91..0","3-01","-3-01","91..0-3-01","91..0-3-01"]
[null,null,null,null,"91.02-3-02","Restauração e conservação de lugares e prédios históricos",null,null,null,"91.0","91..0","3-02","-3-02","91..0-3-02","91..0-3-02"]
[null,null,null,"91.03-1","","Atividades de jardins botânicos, zoológicos, parques nacionais, reservas ecológicas e áreas de proteção ambiental",null,null,null,"",".","","--",".--",""]
[null,null,null,null,"91.03-1-00","Atividades de jardins botânicos, zoológicos, parques nacionais, reservas ecológicas e áreas de proteção ambiental",null,null,null,"91.0","91..0","1-00","-1-00","91..0-1-00","91..0-1-00"]
[null,"92",null,null,"","ATIVIDADES DE EXPLORAÇÃO DE JOGOS DE AZAR E\nAPOSTAS",null,null,null,"",".","","--",".--",""]
[null,null,"92.0",null,"","Atividades de exploração de jogos de azar e apostas",null,null,null,"",".","","--",".--",""]
[null,null,null,"92.00-3","","Atividades de exploração de jogos de azar e apostas",null,null,null,"",".","","--",".--",""]
[null,null,null,null,"92.00-3-01","Casas de bingo",null,null,null,"92.0","92..0","3-01","-3-01","92..0-3-01","92..0-3-01"]
[null,null,null,null,"92.00-3-02","Exploração de apostas em corridas de cavalos",null,null,null,"92.0","92..0","3-02","-3-02","92..0-3-02","92..0-3-02"]
[null,null,null,null,"92.00-3-99","Exploração de jogos de azar e apostas não especificados anteriormente",null,null,null,"92.0","92..0","3-99","-3-99","92..0-3-99","92..0-3-99"]
[null,"93",null,null,"","ATIVIDADES ESPORTIVAS E DE RECREAÇÃO E LAZER",null,null,null,"",".","","--",".--",""]
[null,null,"93.1",null,"","Atividades esportivas",null,null,null,"",".","","--",".--",""]
[null,null,null,"93.11-5","","Gestão de instalações de esportes",null,null,null,{"$f":"LEFT(E2311,4)","v":""},{"$f":"CONCATENATE(LEFT(J2311,2),\".\",RIGHT(J2311,2))","v":"."},{"$f":"RIGHT(E2311,4)","v":""},{"$f":"CONCATENATE(\"-\",LEFT(L2311,1),\"-\",RIGHT(L2311,2))","v":"--"},{"$f":"CONCATENATE(K2311,M2311)","v":".--"},""]
[null,null,null,null,"93.11-5-00","Gestão de instalações de esportes",null,null,null,"93.1","93..1","5-00","-5-00","93..1-5-00","93..1-5-00"]
[null,null,null,"93.12-3","","Clubes sociais, esportivos e similares",null,null,null,"",".","","--",".--",""]
[null,null,null,null,"93.12-3-00","Clubes sociais, esportivos e similares",null,null,null,"93.1","93..1","3-00","-3-00","93..1-3-00","93..1-3-00"]
[null,null,null,"93.13-1","","Atividades de condicionamento físico",null,null,null,"",".","","--",".--",{"$f":"IF(LEN(N2315)=10,N2315,\"\")","v":""}]
[null,null,null,null,"93.13-1-00","Atividades de condicionamento físico",null,null,null,"93.1","93..1","1-00","-1-00","93..1-1-00","93..1-1-00"]
[null,null,null,"93.19-1","","Atividades esportivas não especificadas anteriormente",null,null,null,"",".","","--",".--",""]
[null,null,null,null,"93.19-1-01","Produção e promoção de eventos esportivos",null,null,null,"93.1","93..1","1-01","-1-01","93..1-1-01","93..1-1-01"]
[null,null,null,null,"93.19-1-99","Outras atividades esportivas não especificadas anteriormente",null,null,null,"93.1","93..1","1-99","-1-99","93..1-1-99","93..1-1-99"]
[null,null,"93.2",null,"","Atividades de recreação e lazer",null,null,null,"",".","","--",".--",""]
[null,null,null,"93.21-2","","Parques de diversão e parques temáticos",null,null,null,"",".","","--",".--",""]
[null,null,null,null,"93.21-2-00","Parques de diversão e parques temáticos",null,null,null,"93.2","93..2","2-00","-2-00","93..2-2-00","93..2-2-00"]
[null,null,null,"93.29-8","","Atividades de recreação e lazer não especificadas\nanteriormente",null,null,null,"",".","","--",".--",""]
[null,null,null,null,"93.29-8-01","Discotecas, danceterias, salões de dança e similares",null,null,null,"93.2","93..2","8-01","-8-01","93..2-8-01","93..2-8-01"]
[null,null,null,null,"93.29-8-02","Exploração de boliches",null,null,null,"93.2","93..2","8-02","-8-02","93..2-8-02","93..2-8-02"]
[null,null,null,null,"93.29-8-03","Exploração de jogos de sinuca, bilhar e similares",null,null,null,"93.2","93..2","8-03","-8-03","93..2-8-03","93..2-8-03"]
[null,null,null,null,"93.29-8-04","Exploração de jogos eletrônicos recreativos",null,null,null,"93.2","93..2","8-04","-8-04","93..2-8-04","93..2-8-04"]
[null,null,null,null,"93.29-8-99","Outras atividades de recreação e lazer não especificadas anteriormente",null,null,null,"93.2","93..2","8-99","-8-99","93..2-8-99","93..2-8-99"]
["S",null,null,null,"","OUTRAS ATIVIDADES DE SERVIÇOS",null,null,null,"",".","","--",".--",""]
[null,94,null,null,"","ATIVIDADES DE ORGANIZAÇÕES ASSOCIATIVAS",null,null,null,"",".","","--",".--",""]
[null,null,"94.1",null,"","Atividades de organizações associativas patronais, empresariais e profissionais",null,null,null,"",".","","--",".--",""]
[null,null,null,"94.11-1","","Atividades de organizações associativas patronais e empresariais",null,null,null,"",".","","--",".--",""]
[null,null,null,null,"94.11-1-00","Atividades de organizações associativas patronais e empresariais",null,null,null,"94.1","94..1","1-00","-1-00","94..1-1-00","94..1-1-00"]
[null,null,null,"94.12-0","","Atividades de organizações associativas profissionais",null,null,null,"",".","","--",".--",""]
[null,null,null,null,"94.12-0-01","Atividades de fiscalização profissional",null,null,null,"94.1","94..1","0-01","-0-01","94..1-0-01","94..1-0-01"]
[null,null,null,null,"94.12-0-99","Outras atividades associativas profissionais",null,null,null,"94.1","94..1","0-99","-0-99","94..1-0-99","94..1-0-99"]
[null,null,"94.2",null,"","Atividades de organizações sindicais",null,null,null,"",".","","--",".--",""]
[null,null,null,"94.20-1","","Atividades de organizações sindicais",null,null,null,"",".","","--",".--",""]
[null,null,null,null,"94.20-1-00","Atividades de organizações sindicais",null,null,null,"94.2","94..2","1-00","-1-00","94..2-1-00","94..2-1-00"]
[null,null,"94.3",null,"","Atividades de associações de defesa de direitos sociais",null,null,null,"",".","","--",".--",""]
[null,null,null,"94.30-8","","Atividades de associações de defesa de direitos sociais",null,null,null,"",".","","--",".--",""]
[null,null,null,null,"94.30-8-00","Atividades de associações de defesa de direitos sociais",null,null,null,"94.3","94..3","8-00","-8-00","94..3-8-00","94..3-8-00"]
[null,null,"94.9",null,"","Atividades de organizações associativas não especificadas anteriormente",null,null,null,"",".","","--",".--",""]
[null,null,null,"94.91-0","","Atividades de organizações religiosas",null,null,null,"",".","","--",".--",""]
[null,null,null,null,"94.91-0-00","Atividades de organizações religiosas ou filosóficas",null,null,null,"94.9","94..9","0-00","-0-00","94..9-0-00","94..9-0-00"]
[null,null,null,"94.92-8","","Atividades de organizações políticas",null,null,null,"",".","","--",".--",""]
[null,null,null,null,"94.92-8-00","Atividades de organizações políticas",null,null,null,"94.9","94..9","8-00","-8-00","94..9-8-00","94..9-8-00"]
[null,null,null,"94.93-6","","Atividades de organizações associativas ligadas à cultura\ne à arte",null,null,null,"",".","","--",".--",""]
[null,null,null,null,"94.93-6-00","Atividades de organizações associativas ligadas à cultura e à arte",null,null,null,"94.9","94..9","6-00","-6-00","94..9-6-00","94..9-6-00"]
[null,null,null,"94.99-5","","Atividades associativas não especificadas anteriormente",null,null,null,"",".","","--",".--",""]
[null,null,null,null,"94.99-5-00","Atividades associativas não especificadas anteriormente",null,null,null,"94.9","94..9","5-00","-5-00","94..9-5-00","94..9-5-00"]
[null,95,null,null,"","REPARAÇÃO E MANUTENÇÃO DE EQUIPAMENTOS DE INFORMÁTICA E COMUNICAÇÃO E DE OBJETOS PESSOAIS E DOMÉSTICOS",null,null,null,"",".","","--",".--",""]
[null,null,"95.1",null,"","Reparação e manutenção de equipamentos de informática e comunicação",null,null,null,"",".","","--",".--",""]
[null,null,null,"95.11-8","","Reparação e manutenção de computadores e de equipamentos periféricos",null,null,null,"",".","","--",".--",""]
[null,null,null,null,"95.11-8-00","Reparação e manutenção de computadores e de equipamentos periféricos",null,null,null,"95.1","95..1","8-00","-8-00","95..1-8-00","95..1-8-00"]
[null,null,null,"95.12-6","","Reparação e manutenção de equipamentos de comunicação",null,null,null,"",".","","--",".--",""]
[null,null,null,null,"95.12-6-00","Reparação e manutenção de equipamentos de comunicação",null,null,null,"95.1","95..1","6-00","-6-00","95..1-6-00","95..1-6-00"]
[null,null,"95.2",null,"","Reparação e manutenção de objetos e equipamentos pessoais e domésticos",null,null,null,"",".","","--",".--",""]
[null,null,null,"95.21-5","","Reparação e manutenção de equipamentos eletroeletrônicos de uso pessoal e doméstico",null,null,null,"",".","","--",".--",""]
[null,null,null,null,"95.21-5-00","Reparação e manutenção de equipamentos eletroeletrônicos de uso pessoal e doméstico",null,null,null,"95.2","95..2","5-00","-5-00","95..2-5-00","95..2-5-00"]
[null,null,null,"95.29-1","","Reparação e manutenção de objetos e equipamentos pessoais e domésticos não especificados anteriormente",null,null,null,"",".","","--",".--",""]
[null,null,null,null,"95.29-1-01","Reparação de calçados, bolsas e artigos de viagem",null,null,null,"95.2","95..2","1-01","-1-01","95..2-1-01","95..2-1-01"]
[null,null,null,null,"95.29-1-02","Chaveiros",null,null,null,"95.2","95..2","1-02","-1-02","95..2-1-02","95..2-1-02"]
[null,null,null,null,"95.29-1-03","Reparação de relógios",null,null,null,"95.2","95..2","1-03","-1-03","95..2-1-03","95..2-1-03"]
[null,null,null,null,"95.29-1-04","Reparação de bicicletas, triciclos e outros veículos não motorizados",null,null,null,"95.2","95..2","1-04","-1-04","95..2-1-04","95..2-1-04"]
[null,null,null,null,"95.29-1-05","Reparação de artigos do mobiliário",null,null,null,"95.2","95..2","1-05","-1-05","95..2-1-05","95..2-1-05"]
[null,null,null,null,"95.29-1-06","Reparação de jóias",null,null,null,"95.2","95..2","1-06","-1-06","95..2-1-06","95..2-1-06"]
[null,null,null,null,"95.29-1-99","Reparação e manutenção de outros objetos e equipamentos pessoais e domésticos não especificados anteriormente",null,null,null,"95.2","95..2","1-99","-1-99","95..2-1-99","95..2-1-99"]
[null,"96",null,null,"","OUTRAS ATIVIDADES DE SERVIÇOS PESSOAIS",null,null,null,"",".","","--",".--",""]
[null,null,"96.0",null,"","Outras atividades de serviços pessoais",null,null,null,"",".","","--",".--",""]
[null,null,null,"96.01-7","","Lavanderias, tinturarias e toalheiros",null,null,null,"",".","","--",".--",""]
[null,null,null,null,"96.01-7-01","Lavanderias",null,null,null,"96.0","96..0","7-01","-7-01","96..0-7-01","96..0-7-01"]
[null,null,null,null,"96.01-7-02","Tinturarias",null,null,null,"96.0","96..0","7-02","-7-02","96..0-7-02","96..0-7-02"]
[null,null,null,null,"96.01-7-03","Toalheiros",null,null,null,"96.0","96..0","7-03","-7-03","96..0-7-03","96..0-7-03"]
[null,null,null,"96.02-5","","Cabeleireiros e outras atividades de tratamento de beleza",null,null,null,{"$f":"LEFT(E2375,4)","v":""},{"$f":"CONCATENATE(LEFT(J2375,2),\".\",RIGHT(J2375,2))","v":"."},{"$f":"RIGHT(E2375,4)","v":""},{"$f":"CONCATENATE(\"-\",LEFT(L2375,1),\"-\",RIGHT(L2375,2))","v":"--"},{"$f":"CONCATENATE(K2375,M2375)","v":".--"},""]
[null,null,null,null,"96.02-5-01","Cabeleireiros, manicure e pedicure",null,null,null,"96.0","96..0","5-01","-5-01","96..0-5-01","96..0-5-01"]
[null,null,null,null,"96.02-5-02","Atividades de estética e outros serviços de cuidados com a beleza",null,null,null,"96.0","96..0","5-02","-5-02","96..0-5-02","96..0-5-02"]
[null,null,null,"96.03-3","","Atividades funerárias e serviços relacionados",null,null,null,"",".","","--",".--",""]
[null,null,null,null,"96.03-3-01","Gestão e manutenção de cemitérios",null,null,null,"96.0","96..0","3-01","-3-01","96..0-3-01",{"$f":"IF(LEN(N2379)=10,N2379,\"\")","v":"96..0-3-01"}]
[null,null,null,null,"96.03-3-02","Serviços de cremação",null,null,null,"96.0","96..0","3-02","-3-02","96..0-3-02","96..0-3-02"]
[null,null,null,null,"96.03-3-03","Serviços de sepultamento",null,null,null,"96.0","96..0","3-03","-3-03","96..0-3-03","96..0-3-03"]
[null,null,null,null,"96.03-3-04","Serviços de funerárias",null,null,null,"96.0","96..0","3-04","-3-04","96..0-3-04","96..0-3-04"]
[null,null,null,null,"96.03-3-05","Serviços de somatoconservação",null,null,null,"96.0","96..0","3-05","-3-05","96..0-3-05","96..0-3-05"]
[null,null,null,null,"96.03-3-99","Atividades funerárias e serviços relacionados não especificados anteriormente",null,null,null,"96.0","96..0","3-99","-3-99","96..0-3-99","96..0-3-99"]
[null,null,null,"96.09-2","","Atividades de serviços pessoais não especificadas anteriormente",null,null,null,"",".","","--",".--",""]
[null,null,null,null,"96.09-2-02","Agências matrimoniais",null,null,null,"96.0","96..0","2-02","-2-02","96..0-2-02","96..0-2-02"]
[null,null,null,null,"96.09-2-04","Exploração de máquinas de serviços pessoais acionadas por moeda",null,null,null,"96.0","96..0","2-04","-2-04","96..0-2-04","96..0-2-04"]
[null,null,null,null,"96.09-2-05","Atividades de sauna e banhos",null,null,null,"96.0","96..0","2-05","-2-05","96..0-2-05","96..0-2-05"]
[null,null,null,null,"96.09-2-06","Serviços de tatuagem e colocação de piercing",null,null,null,"96.0","96..0","2-06","-2-06","96..0-2-06","96..0-2-06"]
[null,null,null,null,"96.09-2-07","Alojamento de animais domésticos",null,null,null,"96.0","96..0","2-07","-2-07","96..0-2-07","96..0-2-07"]
[null,null,null,null,"96.09-2-08","Higiene e embelezamento de animais domésticos",null,null,null,"96.0","96..0","2-08","-2-08","96..0-2-08","96..0-2-08"]
[null,null,null,null,"96.09-2-99","Outras atividades de serviços pessoais não especificadas anteriormente",null,null,null,"96.0","96..0","2-99","-2-99","96..0-2-99","96..0-2-99"]
["T",null,null,null,"","SERVIÇOS DOMÉSTICOS",null,null,null,"",".","","--",".--",""]
[null,"97",null,null,"","SERVIÇOS DOMÉSTICOS",null,null,null,"",".","","--",".--",""]
[null,null,"97.0",null,"","Serviços domésticos",null,null,null,"",".","","--",".--",""]
[null,null,null,"97.00-5","","Serviços domésticos",null,null,null,"",".","","--",".--",""]
[null,null,null,null,"97.00-5-00","Serviços domésticos",null,null,null,"97.0","97..0","5-00","-5-00","97..0-5-00","97..0-5-00"]
["U",null,null,null,"","ORGANISMOS INTERNACIONAIS E OUTRAS INSTITUIÇÕES EXTRATERRITORIAIS",null,null,null,"",".","","--",".--",""]
[null,"99",null,null,"","ORGANISMOS INTERNACIONAIS E OUTRAS INSTITUIÇÕES EXTRATERRITORIAIS",null,null,null,"",".","","--",".--",""]
[null,null,"99.0",null,"","Organismos internacionais e outras instituições extraterritoriais",null,null,null,"",".","","--",".--",""]
[null,null,null,"99.00-8","","Organismos internacionais e outras instituições extraterritoriais",null,null,null,"",".","","--",".--",""]